program: Orca
programVersion: 5.0.3
elementType: Cl F F F F F F F O O C C C C C C C C C C C C C C C C C H H H H H H H H H H H H H H
charge: 0
multiplicity: 1
keywords: wb97x-d3
keywords: def2-TZVPP
keywords: def2/J RIJCOSX
keywords: DEFGRID2
keywords: scfconv7
keywords: smallprint printgap noloewdin
keywords: NOSOSCF
formula: C17H14ClF7O2
InChI: InChI=1/C17H14ClF7O2/c1-6-11(19)13(21)7(14(22)12(6)20)5-27-15(26)10-8(16(10,2)3)4-9(18)17(23,24)25/h4,8,10H,5H2,1-3H3
41 atoms
Cl -4.396186 1.906838 0.444898
F  -4.967179 2.275068 -2.477978
F  -3.034546 1.62973 -3.174599
F  -3.206167 3.35924 -1.903113
F  1.640617 0.776923 -0.371668
F  4.272041 -2.800641 1.143392
F  5.891986 -1.093508 2.378949
F  3.264623 2.499745 0.890226
O  0.72462 -1.969513 0.302449
O  -0.410232 -1.535924 -1.583115
C  -2.882963 -2.239998 0.192972
C  -2.751158 -0.745306 0.284465
C  -1.540055 -1.637435 0.532971
C  -3.131438 -2.913762 -1.134049
C  -3.593224 -2.921339 1.339014
C  -2.867628 0.124972 -0.889474
C  -0.38627 -1.692069 -0.391928
C  -3.551231 1.263819 -0.916376
C  1.978276 -1.990239 -0.375818
C  -3.686321 2.135352 -2.128401
C  2.914089 -1.058283 0.33492
C  2.687006 0.310279 0.304053
C  4.006622 -1.497419 1.060651
C  4.847567 -0.607294 1.709042
C  3.521143 1.194188 0.955856
C  4.623672 0.758519 1.678449
C  5.514212 1.738863 2.37821
H  -3.140874 -0.310623 1.19721
H  -1.252593 -1.70884 1.575149
H  -2.808509 -3.955005 -1.090101
H  -4.200826 -2.909372 -1.34867
H  -2.620865 -2.450872 -1.972373
H  -3.259031 -3.955354 1.438735
H  -3.41231 -2.421115 2.290902
H  -4.670879 -2.932831 1.169949
H  -2.368497 -0.175025 -1.80032
H  1.859757 -1.698313 -1.419582
H  2.355771 -3.011345 -0.35571
H  6.27202 1.237464 2.972828
H  6.024025 2.383219 1.661878
H  4.939254 2.382119 3.04347
totalener: -1965.97737858 hartree
nucrepener: 2751.01543231 hartree
electener: -4716.99281089 hartree
oneelecener: -8182.12512305 hartree
twoeener: 3465.13231215 hartree
kineticenergy: 1959.83222391 hartree
xcener: -152.599968326123 hartree
chargesum: 0.0000000
charge: -0.063027 -0.163552 -0.165558 -0.161692 -0.182084 -0.189831 -0.190650 -0.185802 -0.269330 -0.395287 0.062154 0.044124 -0.107742 -0.252327 -0.231096 -0.186407 0.390647 -0.076466 0.035101 0.504976 -0.179244 0.243469 0.228979 0.240504 0.211178 -0.180569 -0.198971 0.078245 0.089979 0.089818 0.095624 0.103127 0.091213 0.074869 0.094222 0.151732 0.132666 0.104304 0.101316 0.106054 0.105334
qa: -0.0630 -0.1636 -0.1656 -0.1617 -0.1821 -0.1898 -0.1907 -0.1858 -0.2693 -0.3953 0.0622 0.0441 -0.1077 -0.2523 -0.2311 -0.1864 0.3906 -0.0765 0.0351 0.5050 -0.1792 0.2435 0.2290 0.2405 0.2112 -0.1806 -0.1990 0.0782 0.0900 0.0898 0.0956 0.1031 0.0912 0.0749 0.0942 0.1517 0.1327 0.1043 0.1013 0.1061 0.1053
va: 1.2746 1.1397 1.1396 1.1443 1.1249 1.1129 1.1110 1.1205 2.1268 2.0941 3.7922 3.7504 3.9150 3.9133 3.9113 3.8848 4.1283 4.0396 3.8665 4.4884 3.6996 3.8845 3.9327 3.8888 3.9792 3.7651 3.9204 1.0382 1.0317 1.0017 1.0014 1.0195 1.0042 1.0087 1.0041 1.0301 1.0169 1.0080 1.0139 0.9995 1.0005
dispcorr: -0.018962618 hartree
energy: -1965.996341196563
dipole: -3.37240 4.09132 0.71893 -27.09681 26.05727 -1.03954 9.60978 -8.50744 1.10234
magnitude: 1.67710 au
magnitude: 4.26284 debye
