program: Orca
programVersion: 5.0.3
elementType: Cl F F F F F F F O O C C C C C C C C C C C C C C C C C H H H H H H H H H H H H H H
charge: 0
multiplicity: 1
keywords: wb97x-d3
keywords: def2-TZVPP
keywords: def2/J RIJCOSX
keywords: DEFGRID2
keywords: scfconv7
keywords: smallprint printgap noloewdin
keywords: NOSOSCF
formula: C17H14ClF7O2
InChI: InChI=1/C17H14ClF7O2/c1-6-11(19)13(21)7(14(22)12(6)20)5-27-15(26)10-8(16(10,2)3)4-9(18)17(23,24)25/h4,8,10H,5H2,1-3H3
41 atoms
Cl -5.443971 0.672904 0.033644
F  -4.583542 3.454564 -0.750426
F  -2.763486 3.453703 0.399104
F  -4.668571 3.242667 1.383888
F  3.068627 1.19591 1.501904
F  2.630035 -3.362616 0.454683
F  4.347555 -3.070815 -1.559015
F  4.79911 1.481382 -0.503867
O  0.531184 -1.729952 1.675298
O  0.18408 0.250616 0.708481
C  -1.862392 -1.444826 -0.975176
C  -2.670994 -0.74027 0.078426
C  -1.42616 -1.51885 0.471974
C  -1.076338 -0.65498 -1.99171
C  -2.4489 -2.717161 -1.538357
C  -2.751311 0.723764 0.164288
C  -0.182425 -0.871276 0.941047
C  -3.888607 1.409469 0.163504
C  1.79599 -1.28108 2.149359
C  -3.971517 2.900599 0.29792
C  2.786443 -1.09358 1.035681
C  3.363205 0.135844 0.758109
C  3.14823 -2.157674 0.225222
C  4.043203 -2.004569 -0.817884
C  4.26367 0.282102 -0.279616
C  4.624774 -0.778107 -1.096867
C  5.604169 -0.582739 -2.213373
H  -3.588324 -1.247688 0.35463
H  -1.624124 -2.465376 0.960977
H  -0.264802 -1.2641 -2.392855
H  -1.727428 -0.384491 -2.823848
H  -0.639231 0.259435 -1.602076
H  -1.65916 -3.378678 -1.897898
H  -3.028928 -3.266272 -0.796011
H  -3.109535 -2.496405 -2.377922
H  -1.830362 1.284896 0.242671
H  2.129017 -2.064903 2.828001
H  1.687358 -0.362266 2.724828
H  5.266968 0.195889 -2.896739
H  6.577711 -0.279075 -1.828708
H  5.743291 -1.493521 -2.788044
totalener: -1965.97762267 hartree
nucrepener: 2787.88474400 hartree
electener: -4753.86236667 hartree
oneelecener: -8255.92332807 hartree
twoeener: 3502.06096140 hartree
kineticenergy: 1959.84233888 hartree
xcener: -152.602312351328 hartree
chargesum: -0.0000000
charge: -0.062151 -0.162874 -0.164626 -0.162689 -0.184169 -0.184556 -0.192856 -0.187858 -0.260158 -0.402315 0.068756 0.021614 -0.096515 -0.250286 -0.232752 -0.187060 0.371983 -0.073984 0.061140 0.502844 -0.226017 0.316592 0.198380 0.232071 0.199413 -0.181745 -0.201612 0.084412 0.091653 0.090087 0.096776 0.102414 0.094016 0.074581 0.094013 0.161444 0.123734 0.117165 0.106106 0.105439 0.099589
qa: -0.0622 -0.1629 -0.1646 -0.1627 -0.1842 -0.1846 -0.1929 -0.1879 -0.2602 -0.4023 0.0688 0.0216 -0.0965 -0.2503 -0.2328 -0.1871 0.3720 -0.0740 0.0611 0.5028 -0.2260 0.3166 0.1984 0.2321 0.1994 -0.1817 -0.2016 0.0844 0.0917 0.0901 0.0968 0.1024 0.0940 0.0746 0.0940 0.1614 0.1237 0.1172 0.1061 0.1054 0.0996
va: 1.2756 1.1410 1.1403 1.1421 1.1223 1.1178 1.1080 1.1183 2.1438 2.0822 3.7941 3.7824 3.9198 3.9144 3.9128 3.8519 4.1230 4.0261 3.8712 4.4915 3.6772 3.8195 3.9770 3.8754 3.9659 3.7608 3.9228 1.0338 1.0300 1.0019 1.0030 1.0176 1.0040 1.0087 1.0041 1.0307 0.9908 1.0197 1.0001 0.9994 1.0145
dispcorr: -0.020039615 hartree
energy: -1965.997662287361
dipole: 8.53185 -7.62541 0.90645 -22.50579 21.02208 -1.48371 -12.56651 12.26674 -0.29977
magnitude: 1.76434 au
magnitude: 4.48460 debye
