program: Orca
programVersion: 5.0.2
elementType: Si F O O C C C C C C C C C C C C C C C C C C C C C C C C C H H H H H H H H H H H H H H H H H H H H H H H H H H H H H
charge: 0
multiplicity: 1
keywords: wb97x-d3
keywords: def2-TZVPP
keywords: def2/J RIJCOSX
keywords: DEFGRID2
keywords: scfconv7
keywords: smallprint printgap noloewdin
keywords: NOSOSCF
formula: C25H29FO2Si
InChI: InChI=1/C25H29FO2Si/c1-4-27-21-13-15-23(16-14-21)29(2,3)18-8-9-20-12-17-24(26)25(19-20)28-22-10-6-5-7-11-22/h5-7,10-17,19H,4,8-9,18H2,1-3H3
58 atoms
Si -2.731696 1.698225 -0.725875
F  2.666197 -1.578786 1.229521
O  0.844669 0.989221 4.103835
O  2.293603 -1.783153 -1.409428
C  -2.774179 -0.018549 -1.512832
C  -3.322178 -1.122415 -0.596117
C  -1.610577 1.590164 0.783976
C  -4.453026 2.217925 -0.173959
C  -2.015713 2.922092 -1.964093
C  -2.545486 -2.443056 -0.685367
C  -0.228498 1.740654 0.677241
C  -2.109886 1.269521 2.052347
C  -1.140957 -2.287833 -0.173082
C  0.629064 1.560321 1.756356
C  -1.278632 1.087696 3.14294
C  0.103479 1.21758 2.999181
C  -0.071695 -2.162928 -1.052145
C  -0.894128 -2.190653 1.196176
C  1.210816 -1.908057 -0.584051
C  0.386381 -1.97043 1.677349
C  1.424253 -1.818769 0.780831
C  2.263523 1.051198 4.004393
C  2.840082 0.735838 5.361773
C  2.201342 -0.994804 -2.530316
C  3.00682 -1.348955 -3.603764
C  1.386682 0.128906 -2.596469
C  2.99203 -0.572225 -4.753325
C  1.373882 0.88877 -3.757755
C  2.171485 0.544523 -4.840543
H  -3.337206 0.008442 -2.450389
H  -1.741162 -0.236157 -1.80716
H  -4.369101 -1.312826 -0.840997
H  -3.322999 -0.812196 0.454286
H  -4.9010 1.488111 0.503819
H  -4.440109 3.179202 0.343035
H  -5.123832 2.315143 -1.030113
H  -1.884866 3.915105 -1.530388
H  -1.042858 2.59575 -2.339809
H  -2.673713 3.026841 -2.829364
H  -3.068039 -3.204213 -0.101088
H  -2.528827 -2.790708 -1.720892
H  0.215238 2.010007 -0.274909
H  -3.177198 1.151921 2.202646
H  1.693226 1.681803 1.606028
H  -1.692754 0.831929 4.110809
H  -0.241796 -2.248931 -2.119014
H  -1.712155 -2.285949 1.89932
H  0.578329 -1.897309 2.740175
H  2.5772 2.04803 3.678886
H  2.619953 0.331986 3.260334
H  2.513187 1.4550 6.113069
H  2.562876 -0.264938 5.693781
H  3.92758 0.77989 5.309896
H  3.641468 -2.223512 -3.537361
H  0.764796 0.418814 -1.759818
H  3.621702 -0.851193 -5.587942
H  0.733179 1.760088 -3.807897
H  2.155488 1.141395 -5.742408
elementType: Si F O C H
totalener: -1510.05271834 hartree
nucrepener: 3022.29811081 hartree
electener: -4532.35082915 hartree
oneelecener: -8074.96692618 hartree
twoeener: 3542.61609703 hartree
cpcmener: -0.02744375 hartree
kineticenergy: 1503.90683514 hartree
xcener: -135.234459108601 hartree
chargesum: 0.0000000
charge: 0.457651 -0.225071 -0.341370 -0.344761 -0.236008 -0.139645 -0.142420 -0.435023 -0.418172 -0.091258 -0.172859 -0.094923 0.106649 -0.245584 -0.301817 0.359139 -0.268039 -0.302925 0.280519 -0.128217 0.157530 0.061978 -0.275804 0.249309 -0.220285 -0.127890 -0.148739 -0.197511 -0.159287 0.099155 0.059938 0.091931 0.070728 0.101156 0.106762 0.106038 0.108362 0.079367 0.107019 0.095568 0.086630 0.145637 0.145185 0.135637 0.132862 0.149618 0.144592 0.154873 0.101301 0.088565 0.087988 0.087401 0.090930 0.148076 0.129831 0.160797 0.167859 0.161029
qa: 0.4577 -0.2251 -0.3414 -0.3448 -0.2360 -0.1396 -0.1424 -0.4350 -0.4182 -0.0913 -0.1729 -0.0949 0.1066 -0.2456 -0.3018 0.3591 -0.2680 -0.3029 0.2805 -0.1282 0.1575 0.0620 -0.2758 0.2493 -0.2203 -0.1279 -0.1487 -0.1975 -0.1593 0.0992 0.0599 0.0919 0.0707 0.1012 0.1068 0.1060 0.1084 0.0794 0.1070 0.0956 0.0866 0.1456 0.1452 0.1356 0.1329 0.1496 0.1446 0.1549 0.1013 0.0886 0.0880 0.0874 0.0909 0.1481 0.1298 0.1608 0.1679 0.1610
va: 4.1343 1.0550 2.0486 2.0709 3.8118 3.9045 3.6602 3.9144 3.9108 3.8455 3.8828 3.8169 3.5438 3.8362 4.0407 3.6610 3.9558 3.9027 3.6537 3.7787 4.0274 3.7785 3.9764 3.7612 3.9563 3.8360 3.9092 3.9128 3.8896 1.0109 1.0162 1.0110 1.0036 1.0106 1.0088 1.0098 1.0111 1.0156 1.0112 1.0058 1.0088 0.9733 0.9831 1.0132 1.0156 1.0019 1.0052 0.9915 0.9900 0.9936 1.0037 1.0030 1.0054 1.0070 0.9916 0.9879 0.9863 0.9899
dispcorr: -0.035977482 hartree
energy: -1510.088695825961
dipole: -18.88675 18.14838 -0.73837 12.97759 -12.74662 0.23097 -0.24854 -0.42573 -0.67428
magnitude: 1.02625 au
magnitude: 2.60851 debye
