program: Orca
programVersion: 5.0.2
elementType: Si F O O C C C C C C C C C C C C C C C C C C C C C C C C C H H H H H H H H H H H H H H H H H H H H H H H H H H H H H
charge: 0
multiplicity: 1
keywords: wb97x-d3
keywords: def2-TZVPP
keywords: def2/J RIJCOSX
keywords: DEFGRID2
keywords: scfconv7
keywords: smallprint printgap noloewdin
keywords: NOSOSCF
formula: C25H29FO2Si
InChI: InChI=1/C25H29FO2Si/c1-4-27-21-13-15-23(16-14-21)29(2,3)18-8-9-20-12-17-24(26)25(19-20)28-22-10-6-5-7-11-22/h5-7,10-17,19H,4,8-9,18H2,1-3H3
58 atoms
Si -3.796749 1.315232 0.00418
F  1.884527 -3.519418 -1.286478
O  2.131228 2.280644 0.735494
O  1.910452 -1.515076 0.601609
C  -4.002007 -0.381835 -0.819721
C  -4.145636 -1.568937 0.133019
C  -1.969398 1.651547 0.303714
C  -4.742248 1.390148 1.629758
C  -4.461595 2.633707 -1.166801
C  -2.945054 -1.819333 1.043467
C  -1.09722 1.768768 -0.785765
C  -1.406531 1.761311 1.572373
C  -1.670029 -2.219668 0.347698
C  0.257116 1.984394 -0.619279
C  -0.043188 1.964488 1.767884
C  0.79894 2.077278 0.66511
C  -0.459861 -1.62943 0.703722
C  -1.653964 -3.228888 -0.612461
C  0.737057 -2.05764 0.153992
C  -0.463383 -3.661882 -1.177876
C  0.722251 -3.086319 -0.776011
C  2.747202 2.366264 2.015721
C  4.200956 2.715693 1.817733
C  2.770953 -0.916591 -0.283906
C  4.076216 -0.744931 0.158515
C  2.381092 -0.462513 -1.535942
C  4.995234 -0.106929 -0.659664
C  3.31396 0.174267 -2.343097
C  4.620679 0.356095 -1.914238
H  -4.893017 -0.333878 -1.454078
H  -3.16638 -0.543583 -1.509527
H  -4.360248 -2.476949 -0.43822
H  -5.019728 -1.417121 0.771547
H  -4.658599 2.375617 2.092128
H  -5.804958 1.202495 1.46257
H  -4.393949 0.655807 2.357944
H  -3.951345 2.617566 -2.131955
H  -5.526429 2.487018 -1.360108
H  -4.338546 3.634595 -0.748454
H  -2.751004 -0.93956 1.661375
H  -3.211143 -2.615575 1.745368
H  -1.478576 1.690641 -1.798662
H  -2.033908 1.679081 2.452819
H  0.907853 2.082094 -1.479178
H  0.336526 2.026447 2.778757
H  -0.437151 -0.83466 1.440018
H  -2.576393 -3.70649 -0.916998
H  -0.452639 -4.456761 -1.912339
H  2.645262 1.412009 2.543089
H  2.257338 3.134418 2.621803
H  4.721533 1.962208 1.227187
H  4.315419 3.681844 1.32609
H  4.691064 2.776069 2.788783
H  4.36515 -1.103555 1.138297
H  1.363086 -0.577982 -1.884466
H  6.011366 0.025171 -0.312109
H  3.006981 0.533125 -3.31659
H  5.339766 0.853631 -2.550246
elementType: Si F O C H
totalener: -1510.05315559 hartree
nucrepener: 3034.91243533 hartree
electener: -4544.96559092 hartree
oneelecener: -8101.22359984 hartree
twoeener: 3556.25800891 hartree
cpcmener: -0.02871870 hartree
kineticenergy: 1503.93081308 hartree
xcener: -135.240569156201 hartree
chargesum: 0.0000000
charge: 0.495613 -0.219634 -0.340640 -0.337036 -0.263072 -0.157725 -0.107882 -0.445485 -0.464183 -0.068382 -0.117860 -0.181343 0.019505 -0.302448 -0.224143 0.335849 -0.288904 -0.198706 0.186252 -0.175334 0.260659 0.036335 -0.285416 0.373118 -0.312193 -0.229404 -0.122373 -0.151939 -0.187887 0.096893 0.079607 0.091614 0.090126 0.112599 0.114857 0.105591 0.100866 0.103087 0.100349 0.077458 0.101851 0.133423 0.145726 0.140283 0.138523 0.167880 0.143677 0.149954 0.104346 0.113160 0.093582 0.090347 0.095697 0.145091 0.152001 0.163033 0.162479 0.160556
qa: 0.4956 -0.2196 -0.3406 -0.3370 -0.2631 -0.1577 -0.1079 -0.4455 -0.4642 -0.0684 -0.1179 -0.1813 0.0195 -0.3024 -0.2241 0.3358 -0.2889 -0.1987 0.1863 -0.1753 0.2607 0.0363 -0.2854 0.3731 -0.3122 -0.2294 -0.1224 -0.1519 -0.1879 0.0969 0.0796 0.0916 0.0901 0.1126 0.1149 0.1056 0.1009 0.1031 0.1003 0.0775 0.1019 0.1334 0.1457 0.1403 0.1385 0.1679 0.1437 0.1500 0.1043 0.1132 0.0936 0.0903 0.0957 0.1451 0.1520 0.1630 0.1625 0.1606
va: 4.0690 1.0655 2.0404 2.0394 3.8385 3.9072 3.6447 3.9135 3.8993 3.7793 3.8658 3.8645 3.6676 3.9874 3.8592 3.7039 3.9491 3.9022 3.7413 3.9228 3.9577 3.7750 3.9663 3.4576 3.9673 3.8550 3.8259 3.8996 3.8998 1.0069 1.0158 1.0019 1.0001 1.0096 1.0074 1.0078 1.0117 1.0108 1.0106 1.0157 1.0029 0.9969 0.9883 1.0089 1.0106 0.9928 1.0033 0.9993 0.9860 0.9907 1.0010 1.0035 1.0071 1.0110 1.0054 0.9865 0.9888 0.9884
dispcorr: -0.036487386 hartree
energy: -1510.089642974153
dipole: -19.72616 18.71666 -1.00951 18.95681 -18.71350 0.24331 7.45466 -6.81531 0.63935
magnitude: 1.21946 au
magnitude: 3.09962 debye
