program: Gaussian 09
title: 000073239
version: EM64L-G09RevD.01
frameworkgroup: C1[X(C12H12N2O2S)]
method: RPBEPBE
basis: SDD
operation: Freq
keyword: #p
keyword: freq=noraman
keyword: PBEPBE/SDD
title: #p freq=noraman PBEPBE/SDD
converged: YES YES NO NO
title: Mulliken charges:
elementType: S O O N N C C C C C C C C C C C C H H H H H H H H H H H H
charge: 0.300241 -0.267850 -0.268841 -0.040291 -0.558649 0.229324 0.402726 -0.488496 -0.384687 -0.384705 -0.189164 0.268607 -0.221054 -0.221075 -0.243155 -0.218602 -0.668465 0.238281 0.238254 0.225776 0.225782 0.227227 0.227004 0.227001 0.205712 0.231475 0.231452 0.333733 0.342439
chargesum: 0.00000
title: Mulliken charges with hydrogens summed into heavy atoms:
elementType: S O O N N C C C C C C C C C C C C
charge: 0.300241 -0.267850 -0.268841 -0.040291 0.117524 0.229324 0.402726 -0.488496 -0.146405 -0.146451 -0.189164 0.268607 0.004721 0.004707 -0.015928 0.235402 0.000175
polarizability: 2.24736636e+02 1.05867259e+00 1.68989933e+02 -2.06109111e-02 6.60131593e-02 1.13621252e+02
1716.lowfreq: -45.9633 -8.1572 -4.9127 0.0013 0.0016 0.0018 7.4989 26.8381 52.0846
frequency: -45.8992 26.8223 52.0846 62.2625 80.2327 93.6641 97.9984 135.9240 189.6335 240.2047 243.2839 257.9402 278.8591 313.0693 342.3556 347.3238 362.6094 371.1439 397.9260 454.4766 468.1464 519.1011 588.4372 590.4369 612.2619 633.4551 651.1289 685.9110 700.1499 724.2085 751.0052 779.6187 796.8113 798.4056 850.8457 869.4716 922.5021 974.7742 988.6670 993.3235 995.5970 1010.0550 1027.7498 1038.1829 1078.5085 1112.1446 1133.4297 1151.2338 1171.6174 1186.5130 1240.8278 1246.2658 1280.8840 1310.4740 1327.9957 1362.0715 1372.9429 1400.6305 1429.4630 1460.8026 1466.8974 1473.5093 1486.1584 1514.3122 1541.9743 1587.4930 1594.2093 1617.4212 1623.0468 2995.4923 3007.9811 3066.3304 3092.1248 3107.8837 3122.5817 3131.3876 3143.2218 3152.7105 3165.1663 3549.6171 3701.7141
redmass: 4.0907 3.3296 4.5679 3.3989 3.4014 7.5164 4.7388 3.3853 5.1967 1.4664 4.2978 3.6866 6.5496 6.1310 6.0456 5.3032 1.1781 3.7625 2.8173 6.4446 1.2348 4.4787 7.4158 5.3431 6.5936 5.0805 7.0382 10.7978 1.7124 10.7258 3.7524 2.8552 4.0349 1.1004 1.2473 5.6221 1.4620 1.3888 6.0609 1.3710 3.4326 2.6972 2.4353 2.9322 1.5930 2.2205 1.4535 3.8113 1.0523 1.1140 4.3100 1.1385 4.1139 1.3496 3.5928 1.6799 7.3588 1.2735 2.2182 1.0399 2.5263 1.0967 1.0974 5.8099 3.4585 6.1015 8.1199 4.5384 1.6834 1.0359 1.0579 1.1067 1.0986 1.1022 1.0843 1.0878 1.0927 1.0970 1.1017 1.0452 1.1047
irintensity: 0.3870 0.9500 0.0000 0.4943 3.1046 3.3648 3.6800 0.0640 4.2334 0.4682 1.2355 6.9476 7.8373 3.3553 3.8924 6.9985 68.0938 2.9017 0.0007 2.4196 231.1513 2.3823 3.8872 17.2751 0.1315 5.8312 12.1825 2.1167 48.4629 12.0914 21.4446 39.9182 9.1460 3.0140 0.1420 17.6690 5.9701 0.0477 2.4882 5.5969 53.4148 7.1906 72.3256 198.0262 8.1688 2.5255 5.4562 118.1947 0.0076 1.0922 151.6565 0.0337 52.7518 0.3742 300.2307 67.4452 0.0039 11.6581 7.8521 14.3346 47.9966 2.3957 18.7119 2.9974 273.6147 0.8323 370.5477 29.0158 368.6520 19.0630 25.5988 8.9002 34.8447 37.9366 0.3321 2.1644 23.4080 36.0184 18.5191 162.9753 51.2576
temp: 298.150 k
press: 1.00000 atm
elementType: 16 8 8 7 7 6 6 6 6 6 6 6 6 6 6 6 6 1 1 1 1 1 1 1 1 1 1 1 1
symmnumber: 1
zpe: 572563.2 jmol-1
zpe.correction: 0.218078 hartree
zpe.thermalcorrener: 0.233839 hartree
zpe.thermalcorrenthalpy: 0.234784 hartree
zpe.thermalcorrgfe: 0.173760 hartree
zpe.sumelectzpe: -1121.266249 hartree
zpe.sumelectthermal: -1121.250488 hartree
zpe.sumelectthermalent: -1121.249544 hartree
zpe.sumelectthermalfe: -1121.310567 hartree
dipole: 0.8046 -2.1554 0.0003
dipole: 2.3006
quadrupole: -73.2517 -112.8780 -101.7063
quadrupole: -13.3300 -0.0025 0.0208
quadrupole: 22.6936 -16.9327 -5.7609 -13.3300 -0.0025 0.0208
hfenergy: -1121.4843273 hartree
pointgroup: C01 [X(C12H12N2O2S1)]
dipole: 0.335196 -0.8407914 -0.0000654 debye
polarizability: 224.6627366|2.287965|169.0638007|-0.0314379|0.0760746|113.6212845 unknown
InChI: InChI=1S/C12H12N2O2S/c1-2-16-11(15)10-9(14-12(13)17-10)8-6-4-3-5-7-8/h3-7H,2,13H2,1H3
charge 0 multiplicity 1
29 atoms
S  3.065482 1.094908 0.000111
O  -0.936794 1.761161 -0.000457
O  0.8924 3.220526 -0.000303
N  2.049002 -1.396932 -0.000011
N  4.430488 -1.347191 -0.000054
C  0.950561 -0.530284 0.000017
C  -0.419654 -1.127847 0.000082
C  1.255493 0.835864 -0.000272
C  -1.065875 -1.433452 -1.222411
C  -1.068132 -1.428319 1.22265
C  3.206631 -0.730383 -0.000054
C  0.431341 2.044996 -0.000844
C  -2.349083 -2.023811 -1.222402
C  -2.351314 -2.018729 1.222748
C  -2.99658 -2.316372 0.000196
C  -1.84075 2.951482 -0.000238
C  -3.266695 2.410313 0.000036
H  -0.565389 -1.205466 -2.169784
H  -0.569417 -1.196307 2.169978
H  -2.841092 -2.25632 -2.173565
H  -2.845053 -2.247304 2.173969
H  -3.991798 -2.775326 0.000243
H  -1.615428 3.560297 0.89429
H  -1.615792 3.560325 -0.894839
H  -3.98623 3.249613 0.000173
H  -3.451316 1.789631 -0.893247
H  -3.450984 1.789622 0.89338
H  5.301403 -0.824467 -0.000007
H  4.449173 -2.365426 -0.000087
