program: Orca
programVersion: 5.0.2
elementType: Si F O O C C C C C C C C C C C C C C C C C C C C C C C C C H H H H H H H H H H H H H H H H H H H H H H H H H H H H H
charge: 0
multiplicity: 1
keywords: wb97x-d3
keywords: def2-TZVPP
keywords: def2/J RIJCOSX
keywords: DEFGRID2
keywords: scfconv7
keywords: smallprint printgap noloewdin
keywords: NOSOSCF
formula: C25H29FO2Si
InChI: InChI=1/C25H29FO2Si/c1-4-27-21-13-15-23(16-14-21)29(2,3)18-8-9-20-12-17-24(26)25(19-20)28-22-10-6-5-7-11-22/h5-7,10-17,19H,4,8-9,18H2,1-3H3
58 atoms
Si -3.204053 1.442615 0.368332
F  1.638321 -4.549825 -0.018797
O  2.570755 3.016848 -0.53942
O  1.895896 -1.889117 -0.389185
C  -3.305534 -0.419705 0.763607
C  -3.843946 -1.33434 -0.337912
C  -1.432975 1.988497 0.023811
C  -3.817173 2.382425 1.881612
C  -4.284655 1.866572 -1.115808
C  -2.889901 -1.565976 -1.513366
C  -0.652174 2.585134 1.020696
C  -0.819932 1.788623 -1.212497
C  -1.672423 -2.361263 -1.132054
C  0.669488 2.932272 0.807378
C  0.512402 2.109155 -1.447063
C  1.270392 2.677086 -0.425463
C  -0.445167 -1.74367 -0.924513
C  -1.755947 -3.742422 -0.957921
C  0.669245 -2.477659 -0.548978
C  -0.648044 -4.489029 -0.588029
C  0.555721 -3.846079 -0.378385
C  3.275785 2.647479 -1.718965
C  4.727791 3.007202 -1.527304
C  2.092735 -1.02095 0.653456
C  1.219478 -0.900107 1.727662
C  3.258809 -0.265571 0.60271
C  1.528722 -0.016308 2.753773
C  3.552862 0.608907 1.636993
C  2.691396 0.739579 2.718754
H  -2.329667 -0.773771 1.113718
H  -3.96532 -0.50519 1.633738
H  -4.778921 -0.927168 -0.731809
H  -4.103026 -2.308899 0.088332
H  -4.863683 2.140728 2.08016
H  -3.25394 2.124344 2.780759
H  -3.751652 3.463973 1.750006
H  -3.947833 1.378009 -2.032124
H  -5.321479 1.566661 -0.950321
H  -4.28274 2.942684 -1.300947
H  -3.431804 -2.10013 -2.297446
H  -2.586026 -0.610195 -1.94717
H  -1.074334 2.779248 2.000012
H  -1.379326 1.347064 -2.030648
H  1.251071 3.387934 1.599196
H  0.935725 1.911069 -2.4225
H  -0.34353 -0.673757 -1.05774
H  -2.699444 -4.247945 -1.123302
H  -0.716773 -5.561611 -0.461291
H  2.862317 3.171058 -2.586724
H  3.169823 1.572815 -1.899642
H  5.286871 2.737048 -2.422688
H  4.859129 4.076813 -1.362797
H  5.164996 2.468633 -0.685608
H  0.309917 -1.484148 1.782563
H  3.931316 -0.367695 -0.239906
H  0.844502 0.078308 3.586829
H  4.462824 1.193013 1.591895
H  2.921383 1.427566 3.52092
elementType: Si F O C H
totalener: -1510.05216473 hartree
nucrepener: 3028.43454588 hartree
electener: -4538.48671061 hartree
oneelecener: -8087.56602515 hartree
twoeener: 3549.07931455 hartree
cpcmener: -0.02960385 hartree
kineticenergy: 1503.90823748 hartree
xcener: -135.235392433588 hartree
chargesum: 0.0000000
charge: 0.496534 -0.219693 -0.338201 -0.341443 -0.279552 -0.129667 -0.177094 -0.482506 -0.433025 -0.124920 -0.076651 -0.118459 -0.066561 -0.304910 -0.251353 0.312955 -0.115987 -0.147378 0.131907 -0.216137 0.257290 0.024710 -0.267335 0.311746 -0.186434 -0.224466 -0.192957 -0.146525 -0.177673 0.073122 0.106392 0.083291 0.093576 0.106784 0.101427 0.103778 0.107487 0.108965 0.113050 0.102055 0.086578 0.143745 0.160233 0.135627 0.139736 0.157303 0.146724 0.149466 0.115494 0.100314 0.093007 0.090667 0.083370 0.154351 0.145394 0.160155 0.162970 0.158724
qa: 0.4965 -0.2197 -0.3382 -0.3414 -0.2796 -0.1297 -0.1771 -0.4825 -0.4330 -0.1249 -0.0767 -0.1185 -0.0666 -0.3049 -0.2514 0.3130 -0.1160 -0.1474 0.1319 -0.2161 0.2573 0.0247 -0.2673 0.3117 -0.1864 -0.2245 -0.1930 -0.1465 -0.1777 0.0731 0.1064 0.0833 0.0936 0.1068 0.1014 0.1038 0.1075 0.1090 0.1131 0.1021 0.0866 0.1437 0.1602 0.1356 0.1397 0.1573 0.1467 0.1495 0.1155 0.1003 0.0930 0.0907 0.0834 0.1544 0.1454 0.1602 0.1630 0.1587
va: 4.0668 1.0672 2.0344 2.0729 3.8152 3.8727 3.7095 3.9319 3.8852 3.8240 3.7959 3.8731 3.7019 3.9945 3.8841 3.7054 3.7594 3.8552 3.7195 3.9203 4.0171 3.8047 3.9682 3.6520 3.7993 3.8878 3.8691 3.8314 3.8485 1.0212 1.0012 1.0043 1.0042 1.0107 1.0108 1.0121 1.0087 1.0072 1.0099 1.0072 1.0145 0.9869 0.9785 1.0144 1.0136 0.9974 0.9982 0.9985 0.9901 0.9806 1.0063 1.0031 1.0035 1.0012 1.0076 0.9911 0.9843 0.9900
dispcorr: -0.036613014 hartree
energy: -1510.088777743983
dipole: -17.13067 15.98028 -1.15038 22.70243 -22.43843 0.26400 -2.06092 1.43351 -0.62741
magnitude: 1.33668 au
magnitude: 3.39757 debye
