program: Orca
programVersion: 5.0.2
elementType: Si F O O C C C C C C C C C C C C C C C C C C C C C C C C C H H H H H H H H H H H H H H H H H H H H H H H H H H H H H
charge: 0
multiplicity: 1
keywords: wb97x-d3
keywords: def2-TZVPP
keywords: def2/J RIJCOSX
keywords: DEFGRID2
keywords: scfconv7
keywords: smallprint printgap noloewdin
keywords: NOSOSCF
formula: C25H29FO2Si
InChI: InChI=1/C25H29FO2Si/c1-4-27-21-13-15-23(16-14-21)29(2,3)18-8-9-20-12-17-24(26)25(19-20)28-22-10-6-5-7-11-22/h5-7,10-17,19H,4,8-9,18H2,1-3H3
58 atoms
Si -3.651661 1.860873 0.38762
F  1.453426 -5.055613 -2.104997
O  2.207667 3.344134 0.784839
O  2.041901 -2.699126 -1.089133
C  -3.747551 0.034429 0.858256
C  -2.875349 -0.852023 -0.031991
C  -1.834631 2.354295 0.484741
C  -4.657793 2.890966 1.599157
C  -4.266027 2.136842 -1.368432
C  -2.574972 -2.21485 0.594705
C  -1.014683 1.904768 1.528458
C  -1.231751 3.157634 -0.480159
C  -1.520507 -2.992028 -0.145038
C  0.324588 2.239274 1.606485
C  0.112681 3.511697 -0.423617
C  0.900185 3.054688 0.628892
C  -0.233379 -2.461335 -0.252429
C  -1.785772 -4.227958 -0.720282
C  0.771377 -3.153901 -0.905547
C  -0.786405 -4.930809 -1.384994
C  0.475934 -4.392374 -1.467024
C  2.86628 4.117566 -0.212972
C  4.308859 4.279453 0.19545
C  2.54437 -1.688245 -0.302437
C  2.532012 -1.763964 1.083942
C  3.134243 -0.61571 -0.952978
C  3.116986 -0.742487 1.81886
C  3.728864 0.391357 -0.205623
C  3.718979 0.33459 1.181128
H  -3.418991 -0.056009 1.900712
H  -4.786829 -0.309037 0.849685
H  -1.925496 -0.3488 -0.236084
H  -3.352637 -0.993758 -1.005495
H  -5.712369 2.607557 1.590892
H  -4.294578 2.76824 2.621546
H  -4.602269 3.9544 1.358619
H  -4.216376 3.188094 -1.659133
H  -3.686522 1.56673 -2.096892
H  -5.308536 1.825941 -1.465341
H  -2.235917 -2.052006 1.622555
H  -3.490925 -2.806282 0.662073
H  -1.422949 1.267699 2.305722
H  -1.811846 3.530422 -1.31674
H  0.933418 1.87234 2.424157
H  0.521204 4.139014 -1.204129
H  -0.021342 -1.494459 0.188113
H  -2.777357 -4.656382 -0.650998
H  -0.988517 -5.895396 -1.832646
H  2.386732 5.096939 -0.308065
H  2.795509 3.617358 -1.184376
H  4.400032 4.789521 1.154601
H  4.820619 3.318779 0.262632
H  4.827152 4.880478 -0.551158
H  2.076867 -2.605867 1.590113
H  3.137316 -0.574078 -2.034594
H  3.106969 -0.797115 2.899562
H  4.198856 1.2232 -0.714079
H  4.181275 1.12114 1.762393
elementType: Si F O C H
totalener: -1510.05342622 hartree
nucrepener: 2888.97484490 hartree
electener: -4399.02827112 hartree
oneelecener: -7808.55216446 hartree
twoeener: 3409.52389334 hartree
cpcmener: -0.02924169 hartree
kineticenergy: 1503.90973159 hartree
xcener: -135.230281314469 hartree
chargesum: 0.0000000
charge: 0.488271 -0.221921 -0.337802 -0.336740 -0.277099 -0.142644 -0.184032 -0.419369 -0.444451 -0.051097 -0.100524 -0.132003 -0.007567 -0.298403 -0.254636 0.348450 -0.235095 -0.213117 0.254334 -0.152962 0.158222 0.028597 -0.277996 0.301636 -0.209135 -0.247868 -0.141588 -0.105207 -0.209249 0.079409 0.094245 0.074789 0.094143 0.102503 0.101062 0.100995 0.105057 0.109992 0.110824 0.090739 0.083083 0.137971 0.141888 0.138628 0.140863 0.137007 0.141406 0.149460 0.112552 0.104195 0.093271 0.084319 0.097220 0.159820 0.147888 0.162794 0.164371 0.160497
qa: 0.4883 -0.2219 -0.3378 -0.3367 -0.2771 -0.1426 -0.1840 -0.4194 -0.4445 -0.0511 -0.1005 -0.1320 -0.0076 -0.2984 -0.2546 0.3485 -0.2351 -0.2131 0.2543 -0.1530 0.1582 0.0286 -0.2780 0.3016 -0.2091 -0.2479 -0.1416 -0.1052 -0.2092 0.0794 0.0942 0.0748 0.0941 0.1025 0.1011 0.1010 0.1051 0.1100 0.1108 0.0907 0.0831 0.1380 0.1419 0.1386 0.1409 0.1370 0.1414 0.1495 0.1126 0.1042 0.0933 0.0843 0.0972 0.1598 0.1479 0.1628 0.1644 0.1605
va: 4.1338 1.0605 2.0443 2.0684 3.8526 3.8619 3.7236 3.8976 3.9065 3.7658 3.8203 3.8916 3.7318 4.0039 3.9254 3.7055 3.9141 3.9055 3.6498 3.8742 4.0433 3.7935 3.9647 3.6551 3.9258 4.0544 3.8688 3.8029 3.8608 1.0159 1.0157 1.0003 1.0092 1.0090 1.0087 1.0093 1.0080 1.0046 1.0081 1.0054 1.0134 0.9907 0.9893 1.0127 1.0108 1.0046 1.0041 0.9980 0.9897 0.9841 1.0027 1.0013 1.0059 0.9945 1.0073 0.9888 0.9815 0.9928
dispcorr: -0.031092660 hartree
energy: -1510.084518880640
dipole: -16.73474 16.05932 -0.67542 31.06234 -29.69825 1.36409 8.05832 -7.73383 0.32449
magnitude: 1.55635 au
magnitude: 3.95593 debye
