program: Orca
programVersion: 5.0.2
elementType: Si F O O C C C C C C C C C C C C C C C C C C C C C C C C C H H H H H H H H H H H H H H H H H H H H H H H H H H H H H
charge: 0
multiplicity: 1
keywords: wb97x-d3
keywords: def2-TZVPP
keywords: def2/J RIJCOSX
keywords: DEFGRID2
keywords: scfconv7
keywords: smallprint printgap noloewdin
keywords: NOSOSCF
formula: C25H29FO2Si
InChI: InChI=1/C25H29FO2Si/c1-4-27-21-13-15-23(16-14-21)29(2,3)18-8-9-20-12-17-24(26)25(19-20)28-22-10-6-5-7-11-22/h5-7,10-17,19H,4,8-9,18H2,1-3H3
58 atoms
Si -2.21227 1.443019 -0.240799
F  1.563882 -5.201758 -0.957498
O  2.292185 4.276682 2.646781
O  1.073434 -2.857903 -2.181668
C  -2.457078 -0.283486 0.481915
C  -3.418187 -1.151977 -0.335928
C  -0.837275 2.312821 0.707633
C  -3.81085 2.436111 -0.141975
C  -1.69082 1.295419 -2.047369
C  -3.359041 -2.637197 0.007841
C  -0.386217 1.864707 1.947957
C  -0.188871 3.431397 0.16884
C  -2.034792 -3.309808 -0.260618
C  0.656827 2.483266 2.6311
C  0.849007 4.064201 0.827161
C  1.280574 3.594242 2.070015
C  -1.094034 -2.763932 -1.127408
C  -1.731973 -4.521108 0.35991
C  0.125654 -3.386394 -1.34685
C  -0.533347 -5.174326 0.118425
C  0.390313 -4.595636 -0.727647
C  2.780752 3.851361 3.914658
C  3.879167 4.798111 4.331441
C  1.406807 -1.531429 -2.026756
C  1.704726 -0.818023 -3.179306
C  1.489214 -0.928617 -0.776201
C  2.088585 0.512359 -3.07758
C  1.869133 0.403854 -0.691594
C  2.1648 1.131438 -1.837233
H  -1.468537 -0.75083 0.538318
H  -2.810989 -0.220571 1.515648
H  -3.241905 -1.02818 -1.408458
H  -4.442466 -0.808019 -0.174545
H  -3.683081 3.443121 -0.544748
H  -4.610685 1.956721 -0.710839
H  -4.155436 2.536937 0.889153
H  -0.837364 0.624078 -2.166603
H  -2.503056 0.907945 -2.665672
H  -1.40621 2.26396 -2.46446
H  -3.611127 -2.77803 1.062436
H  -4.136855 -3.163547 -0.554167
H  -0.842919 0.997395 2.411342
H  -0.492171 3.824147 -0.795757
H  0.965165 2.085612 3.588872
H  1.333198 4.92811 0.387433
H  -1.289853 -1.829216 -1.638902
H  -2.444494 -4.966307 1.043462
H  -0.306492 -6.116926 0.600248
H  3.161303 2.827159 3.848043
H  1.972613 3.857252 4.65288
H  3.509905 5.818386 4.438821
H  4.278247 4.485643 5.295893
H  4.701512 4.798913 3.615453
H  1.637209 -1.301324 -4.146258
H  1.26569 -1.4850 0.125871
H  2.318652 1.067039 -3.978269
H  1.935248 0.874477 0.281543
H  2.455275 2.1710 -1.76152
elementType: Si F O C H
totalener: -1510.05320396 hartree
nucrepener: 2915.83121966 hartree
electener: -4425.88442362 hartree
oneelecener: -7861.89050637 hartree
twoeener: 3436.00608275 hartree
cpcmener: -0.02731439 hartree
kineticenergy: 1503.88027515 hartree
xcener: -135.230345035044 hartree
chargesum: -0.0000000
charge: 0.460039 -0.220694 -0.339216 -0.348049 -0.272382 -0.108825 -0.082809 -0.437087 -0.408168 -0.104115 -0.185951 -0.160963 0.019249 -0.239246 -0.280460 0.350645 -0.196549 -0.217003 0.189865 -0.173950 0.185552 0.066501 -0.275578 0.267941 -0.214319 -0.183757 -0.130473 -0.136942 -0.209375 0.082297 0.099814 0.078815 0.093289 0.101126 0.101968 0.102425 0.050800 0.117160 0.117790 0.086919 0.095857 0.142416 0.134370 0.138303 0.135431 0.165599 0.142981 0.150361 0.095684 0.094648 0.087582 0.090720 0.087211 0.147040 0.156685 0.160239 0.171893 0.156697
qa: 0.4600 -0.2207 -0.3392 -0.3480 -0.2724 -0.1088 -0.0828 -0.4371 -0.4082 -0.1041 -0.1860 -0.1610 0.0192 -0.2392 -0.2805 0.3506 -0.1965 -0.2170 0.1899 -0.1739 0.1856 0.0665 -0.2756 0.2679 -0.2143 -0.1838 -0.1305 -0.1369 -0.2094 0.0823 0.0998 0.0788 0.0933 0.1011 0.1020 0.1024 0.0508 0.1172 0.1178 0.0869 0.0959 0.1424 0.1344 0.1383 0.1354 0.1656 0.1430 0.1504 0.0957 0.0946 0.0876 0.0907 0.0872 0.1470 0.1567 0.1602 0.1719 0.1567
va: 4.1161 1.0646 2.0652 2.0657 3.8468 3.8892 3.6931 3.9158 3.8864 3.8900 3.8894 3.8519 3.6740 3.8636 4.0067 3.7232 3.8542 3.9353 3.7001 3.8728 4.0680 3.7911 3.9729 3.6880 3.9634 3.8526 3.8942 3.8201 3.8766 1.0081 1.0164 0.9995 1.0044 1.0103 1.0081 1.0095 1.0340 1.0109 1.0123 1.0036 1.0015 0.9930 0.9947 1.0128 1.0135 0.9808 0.9992 0.9969 0.9866 0.9870 1.0031 1.0054 1.0034 1.0057 1.0000 0.9884 0.9738 0.9955
dispcorr: -0.033517610 hartree
energy: -1510.086721574061
dipole: -13.12405 12.09364 -1.03041 28.06672 -27.57542 0.49130 11.89696 -10.53277 1.36419
magnitude: 1.77880 au
magnitude: 4.52135 debye
