program: Orca
programVersion: 5.0.2
elementType: Si F O O C C C C C C C C C C C C C C C C C C C C C C C C C H H H H H H H H H H H H H H H H H H H H H H H H H H H H H
charge: 0
multiplicity: 1
keywords: wb97x-d3
keywords: def2-TZVPP
keywords: def2/J RIJCOSX
keywords: DEFGRID2
keywords: scfconv7
keywords: smallprint printgap noloewdin
keywords: NOSOSCF
formula: C25H29FO2Si
InChI: InChI=1/C25H29FO2Si/c1-4-27-21-13-15-23(16-14-21)29(2,3)18-8-9-20-12-17-24(26)25(19-20)28-22-10-6-5-7-11-22/h5-7,10-17,19H,4,8-9,18H2,1-3H3
58 atoms
Si -4.05008 1.540575 0.48515
F  2.1305 -4.021106 -0.454835
O  1.924491 2.35255 1.063462
O  1.934096 -1.557726 0.701687
C  -4.391099 0.188272 -0.812515
C  -3.258709 -0.811221 -1.042483
C  -2.19175 1.801197 0.655376
C  -4.760892 1.077275 2.165997
C  -4.853472 3.138809 -0.105699
C  -2.91991 -1.651532 0.192773
C  -1.398447 2.06142 -0.462687
C  -1.533004 1.720479 1.887018
C  -1.587329 -2.326244 0.046911
C  -0.022406 2.234636 -0.378334
C  -0.165211 1.902768 2.000184
C  0.603339 2.167144 0.865495
C  -0.432751 -1.644239 0.427776
C  -1.458163 -3.587689 -0.523457
C  0.814363 -2.21478 0.262812
C  -0.208847 -4.170387 -0.69958
C  0.913887 -3.479122 -0.301417
C  2.735285 2.751272 -0.039016
C  4.10845 3.09026 0.485208
C  2.808674 -1.056295 -0.228949
C  2.466363 -0.848933 -1.559288
C  4.078947 -0.733311 0.23419
C  3.4174 -0.326703 -2.428248
C  5.013968 -0.210422 -0.645699
C  4.691347 -0.006078 -1.981863
H  -5.308346 -0.339628 -0.526345
H  -4.625516 0.684884 -1.760362
H  -2.361667 -0.274592 -1.361865
H  -3.50937 -1.486812 -1.866075
H  -4.606567 1.868989 2.902193
H  -5.838468 0.914175 2.090192
H  -4.32452 0.161401 2.569117
H  -4.731007 3.944473 0.62084
H  -4.420366 3.476959 -1.049528
H  -5.925277 3.004939 -0.269259
H  -2.892358 -1.015808 1.081555
H  -3.707265 -2.389324 0.364436
H  -1.852601 2.130357 -1.445654
H  -2.093711 1.513688 2.791466
H  0.53847 2.423817 -1.283622
H  0.315781 1.845009 2.969205
H  -0.502225 -0.65735 0.872267
H  -2.341633 -4.132667 -0.831678
H  -0.109879 -5.155172 -1.137838
H  2.296392 3.624905 -0.531644
H  2.787039 1.945815 -0.778303
H  4.077844 3.94776 1.157922
H  4.559453 2.250167 1.013248
H  4.758917 3.344773 -0.351281
H  1.475364 -1.082838 -1.928411
H  4.332431 -0.896875 1.274107
H  3.149553 -0.168547 -3.464958
H  6.003148 0.034232 -0.28028
H  5.425568 0.39743 -2.66659
elementType: Si F O C H
totalener: -1510.05374284 hartree
nucrepener: 2993.62834840 hartree
electener: -4503.68209124 hartree
oneelecener: -8017.99465212 hartree
twoeener: 3514.31256088 hartree
cpcmener: -0.02626634 hartree
kineticenergy: 1503.89955563 hartree
xcener: -135.231874363604 hartree
chargesum: -0.0000000
charge: 0.489473 -0.220109 -0.341405 -0.333376 -0.292536 -0.142309 -0.132660 -0.433553 -0.453569 -0.077479 -0.213773 -0.089847 -0.033009 -0.223061 -0.260349 0.327880 -0.144992 -0.147552 0.116338 -0.202378 0.288581 0.042211 -0.291272 0.286368 -0.179644 -0.237841 -0.163590 -0.153022 -0.168608 0.087357 0.100040 0.085509 0.095823 0.105763 0.110474 0.106934 0.100344 0.101138 0.102379 0.077214 0.098441 0.143401 0.143117 0.140673 0.131394 0.092762 0.146460 0.150066 0.123134 0.076269 0.102216 0.088414 0.097407 0.152955 0.144599 0.158926 0.162114 0.159757
qa: 0.4895 -0.2201 -0.3414 -0.3334 -0.2925 -0.1423 -0.1327 -0.4336 -0.4536 -0.0775 -0.2138 -0.0898 -0.0330 -0.2231 -0.2603 0.3279 -0.1450 -0.1476 0.1163 -0.2024 0.2886 0.0422 -0.2913 0.2864 -0.1796 -0.2378 -0.1636 -0.1530 -0.1686 0.0874 0.1000 0.0855 0.0958 0.1058 0.1105 0.1069 0.1003 0.1011 0.1024 0.0772 0.0984 0.1434 0.1431 0.1407 0.1314 0.0928 0.1465 0.1501 0.1231 0.0763 0.1022 0.0884 0.0974 0.1530 0.1446 0.1589 0.1621 0.1598
va: 4.0797 1.0651 2.0284 2.0456 3.8736 3.8560 3.6964 3.8987 3.8997 3.7631 3.9144 3.7906 3.7138 3.8270 4.0078 3.6928 3.8425 3.8726 3.7927 3.9380 3.9543 3.7634 3.9608 3.5650 3.8054 3.9402 3.8944 3.8510 3.8475 1.0107 1.0070 1.0066 1.0093 1.0072 1.0107 1.0080 1.0112 1.0108 1.0096 1.0206 1.0111 0.9898 0.9894 1.0106 1.0155 1.0365 0.9995 0.9988 0.9974 0.9845 1.0065 1.0021 1.0041 1.0044 1.0109 0.9909 0.9874 0.9897
dispcorr: -0.035312569 hartree
energy: -1510.089055406812
dipole: -19.82194 18.96753 -0.85441 23.07456 -22.55261 0.52196 -1.77851 0.53528 -1.24323
magnitude: 1.59627 au
magnitude: 4.05739 debye
