program: Orca
programVersion: 5.0.2
elementType: Si F O O C C C C C C C C C C C C C C C C C C C C C C C C C H H H H H H H H H H H H H H H H H H H H H H H H H H H H H
charge: 0
multiplicity: 1
keywords: wb97x-d3
keywords: def2-TZVPP
keywords: def2/J RIJCOSX
keywords: DEFGRID2
keywords: scfconv7
keywords: smallprint printgap noloewdin
keywords: NOSOSCF
formula: C25H29FO2Si
InChI: InChI=1/C25H29FO2Si/c1-4-27-21-13-15-23(16-14-21)29(2,3)18-8-9-20-12-17-24(26)25(19-20)28-22-10-6-5-7-11-22/h5-7,10-17,19H,4,8-9,18H2,1-3H3
58 atoms
Si -3.604351 1.109963 1.254006
F  1.929074 -3.956631 0.033339
O  1.618228 3.834057 -0.173098
O  1.898428 -1.673863 -1.502426
C  -3.544973 -0.579854 0.413392
C  -3.350664 -0.512337 -1.100042
C  -1.971733 1.964432 0.857647
C  -3.792278 0.856172 3.11076
C  -5.017851 2.166548 0.599922
C  -2.982512 -1.856195 -1.734926
C  -1.875796 3.335629 0.598272
C  -0.791127 1.226712 0.76151
C  -1.674446 -2.41282 -1.241381
C  -0.674755 3.93529 0.257449
C  0.422608 1.803112 0.413649
C  0.487563 3.169828 0.157717
C  -0.474423 -1.762406 -1.530603
C  -1.627793 -3.576299 -0.480924
C  0.737407 -2.276909 -1.102496
C  -0.419815 -4.098951 -0.03562
C  0.75028 -3.453095 -0.362656
C  2.807467 3.103932 -0.461008
C  2.776877 2.439095 -1.821348
C  2.812317 -1.230396 -0.581588
C  4.077708 -0.940908 -1.078147
C  2.516927 -1.030728 0.759962
C  5.049902 -0.44556 -0.223924
C  3.50464 -0.53871 1.604305
C  4.771387 -0.243716 1.122347
H  -2.724178 -1.139748 0.876671
H  -4.451834 -1.145828 0.650382
H  -2.577869 0.21831 -1.357388
H  -4.268202 -0.150321 -1.57118
H  -4.729942 0.348392 3.347517
H  -2.980326 0.243609 3.50825
H  -3.785611 1.802669 3.654385
H  -5.053455 3.141759 1.089854
H  -4.932512 2.343264 -0.473926
H  -5.980984 1.683612 0.777493
H  -3.776916 -2.580365 -1.539622
H  -2.933497 -1.731331 -2.820153
H  -2.759266 3.961837 0.652131
H  -0.798975 0.157988 0.948892
H  -0.630157 4.999351 0.0585
H  1.297179 1.171592 0.347101
H  -0.472119 -0.849555 -2.115708
H  -2.546673 -4.093766 -0.2362
H  -0.387337 -5.009826 0.547958
H  3.023898 2.379287 0.329802
H  3.6027 3.848469 -0.431498
H  3.751168 1.993283 -2.023117
H  2.031277 1.646278 -1.889569
H  2.575903 3.168152 -2.607091
H  4.292797 -1.097955 -2.127676
H  1.529149 -1.232763 1.155821
H  6.03316 -0.219799 -0.615577
H  3.270967 -0.382027 2.649167
H  5.533761 0.14041 1.786549
elementType: Si F O C H
totalener: -1510.05273924 hartree
nucrepener: 2974.38654871 hartree
electener: -4484.43928795 hartree
oneelecener: -7978.76073233 hartree
twoeener: 3494.32144438 hartree
cpcmener: -0.02537143 hartree
kineticenergy: 1503.90315764 hartree
xcener: -135.233307258881 hartree
chargesum: 0.0000000
charge: 0.477268 -0.218907 -0.351475 -0.333869 -0.266073 -0.137910 -0.147798 -0.422221 -0.448544 -0.092615 -0.114586 -0.190908 0.023079 -0.254305 -0.152697 0.293496 -0.296180 -0.169002 0.206986 -0.164981 0.237712 0.084571 -0.294365 0.349156 -0.311503 -0.193599 -0.089599 -0.149791 -0.218254 0.078788 0.092211 0.081667 0.092782 0.102493 0.101595 0.101304 0.106247 0.108962 0.110062 0.083057 0.100088 0.138430 0.142859 0.134264 0.070009 0.143701 0.143732 0.150765 0.071722 0.109296 0.098999 0.089237 0.105142 0.145173 0.163446 0.161252 0.160807 0.158825
qa: 0.4773 -0.2189 -0.3515 -0.3339 -0.2661 -0.1379 -0.1478 -0.4222 -0.4485 -0.0926 -0.1146 -0.1909 0.0231 -0.2543 -0.1527 0.2935 -0.2962 -0.1690 0.2070 -0.1650 0.2377 0.0846 -0.2944 0.3492 -0.3115 -0.1936 -0.0896 -0.1498 -0.2183 0.0788 0.0922 0.0817 0.0928 0.1025 0.1016 0.1013 0.1062 0.1090 0.1101 0.0831 0.1001 0.1384 0.1429 0.1343 0.0700 0.1437 0.1437 0.1508 0.0717 0.1093 0.0990 0.0892 0.1051 0.1452 0.1634 0.1613 0.1608 0.1588
va: 4.1402 1.0661 2.0667 2.0527 3.8439 3.8617 3.7286 3.8839 3.9050 3.8409 3.8828 3.8710 3.6247 4.0316 3.7437 3.7927 3.9445 3.8627 3.6920 3.9183 3.9696 3.8221 3.9151 3.5130 3.9718 3.8362 3.8208 3.8748 3.9075 1.0149 1.0155 1.0029 1.0081 1.0086 1.0086 1.0096 1.0086 1.0051 1.0079 1.0089 1.0041 0.9880 0.9812 1.0147 1.0693 1.0095 1.0015 0.9978 1.0058 0.9938 1.0070 0.9981 1.0106 1.0117 0.9992 0.9869 0.9913 0.9916
dispcorr: -0.034873119 hartree
energy: -1510.087612362865
dipole: -19.39980 18.84258 -0.55722 16.87165 -17.25713 -0.38548 2.38501 -2.36081 0.02420
magnitude: 0.67799 au
magnitude: 1.72332 debye
