program: Orca
programVersion: 5.0.2
elementType: Si F O O C C C C C C C C C C C C C C C C C C C C C C C C C H H H H H H H H H H H H H H H H H H H H H H H H H H H H H
charge: 0
multiplicity: 1
keywords: wb97x-d3
keywords: def2-TZVPP
keywords: def2/J RIJCOSX
keywords: DEFGRID2
keywords: scfconv7
keywords: smallprint printgap noloewdin
keywords: NOSOSCF
formula: C25H29FO2Si
InChI: InChI=1/C25H29FO2Si/c1-4-27-21-13-15-23(16-14-21)29(2,3)18-8-9-20-12-17-24(26)25(19-20)28-22-10-6-5-7-11-22/h5-7,10-17,19H,4,8-9,18H2,1-3H3
58 atoms
Si -3.386236 1.394348 0.595133
F  1.427129 -4.744688 0.52169
O  2.340513 3.352045 0.3152
O  1.379889 -2.063459 0.606562
C  -3.507807 -0.404032 0.027189
C  -3.132171 -0.602059 -1.442887
C  -1.584107 1.950015 0.531018
C  -4.017246 1.552813 2.361061
C  -4.392444 2.483908 -0.564806
C  -2.921591 -2.057456 -1.844824
C  -0.804025 2.04631 1.682669
C  -0.96445 2.303164 -0.675898
C  -1.764309 -2.757122 -1.176303
C  0.513102 2.493535 1.659283
C  0.346362 2.740994 -0.727771
C  1.091078 2.862097 0.447282
C  -0.715751 -2.056766 -0.589151
C  -1.713041 -4.151175 -1.163295
C  0.360999 -2.723888 -0.023995
C  -0.64684 -4.829733 -0.595047
C  0.387318 -4.107706 -0.03528
C  3.129239 3.553984 1.481599
C  4.465603 4.104892 1.050476
C  2.150891 -1.160791 -0.078632
C  3.035777 -0.420655 0.698538
C  2.105412 -0.984534 -1.455283
C  3.884354 0.488955 0.09029
C  2.947025 -0.048735 -2.045373
C  3.837313 0.691727 -1.283469
H  -2.861875 -1.001244 0.67923
H  -4.523624 -0.775475 0.198705
H  -2.235674 -0.029516 -1.699838
H  -3.923123 -0.188259 -2.072643
H  -3.93324 2.575343 2.733442
H  -5.070989 1.271501 2.416751
H  -3.475443 0.903632 3.051566
H  -4.016204 2.446136 -1.589186
H  -5.436815 2.165348 -0.592053
H  -4.376106 3.528891 -0.249596
H  -3.834729 -2.626937 -1.651391
H  -2.768192 -2.105193 -2.927868
H  -1.224552 1.780179 2.64583
H  -1.517894 2.251586 -1.606869
H  1.060569 2.560532 2.589641
H  0.796805 3.016139 -1.673855
H  -0.715821 -0.973427 -0.562034
H  -2.522135 -4.720099 -1.604453
H  -0.615246 -5.91167 -0.588685
H  3.261331 2.610678 2.020985
H  2.626611 4.253128 2.158045
H  5.089922 4.26416 1.929137
H  4.990746 3.414888 0.388853
H  4.359142 5.061788 0.539097
H  3.065962 -0.571242 1.770381
H  1.433776 -1.560574 -2.077154
H  4.582306 1.049362 0.698422
H  2.901938 0.091106 -3.117571
H  4.491691 1.414181 -1.752559
elementType: Si F O C H
totalener: -1510.05294405 hartree
nucrepener: 2969.20825286 hartree
electener: -4479.26119691 hartree
oneelecener: -7969.45951462 hartree
twoeener: 3490.19831771 hartree
cpcmener: -0.02985517 hartree
kineticenergy: 1503.90385305 hartree
xcener: -135.234766131639 hartree
chargesum: -0.0000000
charge: 0.500460 -0.219781 -0.333847 -0.337646 -0.273892 -0.099557 -0.189841 -0.465698 -0.432632 -0.115680 -0.112577 -0.050321 0.030785 -0.264715 -0.366880 0.365214 -0.214440 -0.210360 0.225253 -0.179577 0.188005 0.022265 -0.272745 0.354354 -0.297151 -0.215080 -0.085008 -0.167137 -0.211591 0.089040 0.094485 0.074467 0.094503 0.106804 0.106399 0.102289 0.102857 0.108104 0.108613 0.086735 0.096813 0.142898 0.145368 0.139582 0.132705 0.130605 0.143776 0.151018 0.097245 0.121639 0.094713 0.081631 0.093200 0.142874 0.157787 0.163952 0.160074 0.159647
qa: 0.5005 -0.2198 -0.3338 -0.3376 -0.2739 -0.0996 -0.1898 -0.4657 -0.4326 -0.1157 -0.1126 -0.0503 0.0308 -0.2647 -0.3669 0.3652 -0.2144 -0.2104 0.2253 -0.1796 0.1880 0.0223 -0.2727 0.3544 -0.2972 -0.2151 -0.0850 -0.1671 -0.2116 0.0890 0.0945 0.0745 0.0945 0.1068 0.1064 0.1023 0.1029 0.1081 0.1086 0.0867 0.0968 0.1429 0.1454 0.1396 0.1327 0.1306 0.1438 0.1510 0.0972 0.1216 0.0947 0.0816 0.0932 0.1429 0.1578 0.1640 0.1601 0.1596
va: 4.1230 1.0670 2.0325 2.0749 3.8112 3.8763 3.7180 3.9280 3.8873 3.8973 3.8667 3.7704 3.6753 3.8934 4.0375 3.6521 3.8638 3.9283 3.6561 3.8716 4.0663 3.7952 3.9610 3.6247 3.9674 3.8561 3.7938 3.9015 3.8840 1.0094 1.0146 0.9985 1.0026 1.0098 1.0116 1.0100 1.0082 1.0065 1.0086 1.0028 1.0003 0.9872 0.9820 1.0119 1.0189 1.0059 0.9988 0.9969 0.9826 0.9921 1.0049 1.0046 1.0039 1.0135 0.9975 0.9780 0.9905 0.9915
dispcorr: -0.033758937 hartree
energy: -1510.086702987686
dipole: -14.71274 13.96162 -0.75112 26.67183 -26.03332 0.63851 -0.28022 0.01861 -0.26160
magnitude: 1.01995 au
magnitude: 2.59252 debye
