program: Gaussian 09
title: 000062275
version: EM64L-G09RevD.01
frameworkgroup: C1[X(C11H11N5)]
method: RPBEPBE
basis: SDD
operation: Freq
keyword: #pfreq=noraman
keyword: PBEPBE/SDD
title: #p freq=noraman PBEPBE/SDD
converged: NO NO NO NO
title: Mulliken charges:
elementType: N N N N N C C C C C C C C C C C H H H H H H H H H H H
charge: -0.231994 -0.048438 0.014690 -0.001758 -0.627799 0.350860 -0.068117 -0.054344 0.057465 0.122225 -0.367448 -0.341764 -0.662844 0.233964 -0.432023 -0.787874 0.226131 0.254384 0.242406 0.251250 0.242439 0.243231 0.344947 0.328712 0.226515 0.226462 0.258722
chargesum: 0.00000
title: Mulliken charges with hydrogens summed into heavy atoms:
elementType: N N N N N C C C C C C C C C C C
charge: -0.231994 -0.048438 0.014690 -0.001758 0.045860 0.350860 -0.068117 -0.054344 0.057465 0.122225 -0.141317 -0.087381 0.073250 0.233964 -0.188792 -0.076174
polarizability: 2.65855940e+02 -2.81042664e+00 1.65639239e+02 -1.96246769e-02 -5.72672097e-03 6.96727370e+01
1716.lowfreq: -73.6493 -2.6863 0.0001 0.0004 0.0007 8.3326 13.9084 58.2922 71.3870
frequency: -73.5592 58.2487 71.3825 84.4902 119.1348 151.8237 158.1653 212.3755 247.9594 260.6367 290.4077 311.5809 357.2072 358.0866 434.5707 451.1719 454.8649 465.9651 549.7931 559.0247 586.6015 587.6782 637.0166 656.0794 687.9818 718.2395 732.8810 779.8280 795.3203 831.1929 845.4830 903.8151 914.9354 945.1289 967.8885 1006.9476 1032.1689 1045.6017 1072.1737 1119.9769 1131.5217 1171.9261 1208.8003 1226.1840 1258.6475 1280.2015 1300.9915 1331.4132 1378.9826 1384.9512 1392.0496 1402.6371 1442.0061 1455.7596 1463.0973 1466.8411 1475.6588 1481.3586 1483.3055 1525.1269 1556.0676 1581.5033 1598.2717 1640.3856 2971.4570 2978.8252 3046.7193 3055.4639 3109.6811 3114.6799 3116.1387 3131.2126 3171.0452 3577.2190 3724.2495
redmass: 1.0593 1.1816 2.1833 4.3051 1.7543 3.2718 4.0469 2.2901 6.1238 2.8033 3.1490 4.2398 5.0019 4.4758 5.5339 3.4383 1.4151 4.4060 5.3970 5.0492 4.2316 3.3084 10.0386 4.9807 8.3137 3.7610 5.8851 6.9499 2.1706 3.8064 4.5138 1.3300 3.7580 1.3308 1.7683 2.5565 2.6002 1.5866 2.8549 1.3090 1.4759 1.9458 3.1481 5.4841 2.7718 4.1597 3.3202 4.4431 2.5589 2.0368 2.0028 2.6364 1.8118 1.5940 2.6150 1.0467 1.0404 2.8246 1.1306 5.4182 2.5802 6.2617 2.8606 2.6024 1.0367 1.0381 1.1024 1.0971 1.0965 1.0965 1.0934 1.0892 1.0953 1.0450 1.1048
irintensity: 14.6424 1.7659 0.0695 0.4050 66.4067 17.5065 5.5259 50.7625 2.1220 0.4014 3.0141 6.4658 0.6043 26.4698 0.5535 50.3387 107.8438 1.2562 1.0580 4.0117 13.3478 5.6761 4.5598 4.6486 3.4071 9.8901 3.9710 2.4922 28.1883 15.0888 2.6033 15.0889 1.7269 1.1889 39.6594 10.7758 5.4348 8.1442 29.5757 0.4560 14.2057 31.2083 5.1372 3.4087 36.6665 48.0274 3.5953 2.9065 66.2023 7.4622 23.9849 72.0492 5.2527 15.5413 71.1587 15.8791 14.1778 14.0444 11.3978 67.6676 181.1157 10.0217 43.9539 572.4079 78.4598 24.5040 26.6225 20.2530 7.4851 7.4244 31.0989 11.9248 11.0265 138.9642 42.7254
temp: 298.150 k
press: 1.00000 atm
elementType: 7 7 7 7 7 6 6 6 6 6 6 6 6 6 6 6 1 1 1 1 1 1 1 1 1 1 1
symmnumber: 1
zpe: 544888.3 jmol-1
zpe.correction: 0.207537 hartree
zpe.thermalcorrener: 0.220960 hartree
zpe.thermalcorrenthalpy: 0.221904 hartree
zpe.thermalcorrgfe: 0.167467 hartree
zpe.sumelectzpe: -698.416491 hartree
zpe.sumelectthermal: -698.403067 hartree
zpe.sumelectthermalent: -698.402123 hartree
zpe.sumelectthermalfe: -698.456560 hartree
dipole: 6.2616 0.4237 -0.0008
dipole: 6.2759
quadrupole: -54.2461 -92.2582 -96.5398
quadrupole: 3.3136 -0.0097 0.0022
quadrupole: 26.7686 -11.2435 -15.5251 3.3136 -0.0097 0.0022
hfenergy: -698.6240276 hartree
pointgroup: C01 [X(C11H11N5)]
dipole: -2.4571829 -0.242758 -0.0003115 debye
polarizability: 265.9338461|0.2915151|165.5613336|0.0194383|0.0063307|69.672737 unknown
InChI: InChI=1S/C11H11N5/c1-6-5-13-7-3-4-8-10(9(7)14-6)15-11(12)16(8)2/h3-5H,12H2,1-2H3
charge 0 multiplicity 1
27 atoms
N  -2.772156 -0.22039 -0.000236
N  -1.331571 1.577819 -0.000276
N  1.70911 1.236972 0.00012
N  2.656968 -1.481431 0.000065
N  -3.70183 2.033048 -0.000243
C  -1.464625 -0.75561 -0.000193
C  -0.594504 0.379864 -0.000116
C  0.822058 0.173002 0.000051
C  1.294507 -1.208532 0.000026
C  -2.61963 1.178911 -0.000277
C  -1.005156 -2.097096 -0.000209
C  0.377154 -2.311193 -0.000095
C  -4.035865 -0.955643 -0.000091
C  3.031354 0.943285 0.000206
C  3.49014 -0.422884 0.000164
C  4.012813 2.09354 0.000564
H  -1.697164 -2.946764 -0.000297
H  0.801285 -3.31932 -0.000115
H  -4.635305 -0.725742 0.901465
H  -3.827769 -2.03667 0.001148
H  -4.634556 -0.72761 -0.902622
H  4.565032 -0.642013 0.00034
H  -3.505391 3.029727 -0.000321
H  -4.662139 1.70634 -0.000922
H  4.668575 2.063828 0.891481
H  4.670451 2.062789 -0.888912
H  3.457012 3.043873 -0.000505
