program: Orca
programVersion: 5.0.2
elementType: Si F O O C C C C C C C C C C C C C C C C C C C C C C C C C H H H H H H H H H H H H H H H H H H H H H H H H H H H H H
charge: 0
multiplicity: 1
keywords: wb97x-d3
keywords: def2-TZVPP
keywords: def2/J RIJCOSX
keywords: DEFGRID2
keywords: scfconv7
keywords: smallprint printgap noloewdin
keywords: NOSOSCF
formula: C25H29FO2Si
InChI: InChI=1/C25H29FO2Si/c1-4-27-21-13-15-23(16-14-21)29(2,3)18-8-9-20-12-17-24(26)25(19-20)28-22-10-6-5-7-11-22/h5-7,10-17,19H,4,8-9,18H2,1-3H3
58 atoms
Si -3.819299 1.156081 0.284745
F  1.784715 -2.444631 1.873827
O  2.006474 1.895841 1.74757
O  2.132674 -0.807848 -0.177295
C  -3.9011 -0.563008 -0.484166
C  -3.083452 -0.665235 -1.77901
C  -2.018047 1.417835 0.76715
C  -4.891739 1.236614 1.828152
C  -4.339883 2.464381 -0.961825
C  -2.329357 -1.99009 -1.92865
C  -1.468488 0.729361 1.849084
C  -1.154633 2.248677 0.045999
C  -1.233906 -2.138033 -0.90817
C  -0.13394 0.857181 2.214614
C  0.179315 2.390829 0.386921
C  0.699733 1.696986 1.479709
C  -0.058235 -1.399334 -1.047044
C  -1.377215 -2.963919 0.200561
C  0.965991 -1.510128 -0.120815
C  -0.367171 -3.065151 1.149953
C  0.79305 -2.348397 0.973965
C  2.616133 1.170001 2.809438
C  4.084694 1.512272 2.821728
C  2.668691 -0.460293 -1.393282
C  3.152329 0.832307 -1.528538
C  2.787147 -1.377009 -2.430668
C  3.760027 1.211169 -2.71798
C  3.387462 -0.980839 -3.617144
C  3.87482 0.311413 -3.767921
H  -3.515702 -1.255203 0.272764
H  -4.934886 -0.872431 -0.661141
H  -2.348377 0.144042 -1.855025
H  -3.745381 -0.534555 -2.637477
H  -5.940503 1.041563 1.594729
H  -4.582354 0.498066 2.570558
H  -4.83768 2.218545 2.302011
H  -5.381551 2.320552 -1.256884
H  -4.254961 3.47295 -0.55281
H  -3.73922 2.427501 -1.872746
H  -3.030491 -2.823269 -1.840352
H  -1.898455 -2.044446 -2.931457
H  -2.087794 0.064606 2.44226
H  -1.523389 2.806917 -0.80703
H  0.233086 0.302179 3.067432
H  0.824089 3.043325 -0.189585
H  0.056573 -0.737812 -1.897953
H  -2.282792 -3.542592 0.330067
H  -0.476813 -3.709472 2.012731
H  2.47782 0.094875 2.664139
H  2.150362 1.437438 3.763295
H  4.575648 0.964262 3.62541
H  4.566835 1.232808 1.884215
H  4.249073 2.576027 2.995033
H  3.065654 1.534574 -0.709959
H  2.420026 -2.389775 -2.321243
H  4.138336 2.219847 -2.820122
H  3.478188 -1.693517 -4.426349
H  4.343867 0.612089 -4.695183
elementType: Si F O C H
totalener: -1510.05382342 hartree
nucrepener: 3047.12384760 hartree
electener: -4557.17767101 hartree
oneelecener: -8125.83263481 hartree
twoeener: 3568.65496380 hartree
cpcmener: -0.02606278 hartree
kineticenergy: 1503.92059295 hartree
xcener: -135.236013112906 hartree
chargesum: 0.0000000
charge: 0.482507 -0.224625 -0.338050 -0.332643 -0.265417 -0.124442 -0.120572 -0.446160 -0.431625 -0.099144 -0.218824 -0.104410 0.073082 -0.216688 -0.291836 0.340222 -0.257668 -0.232331 0.237350 -0.131513 0.152041 0.039859 -0.270807 0.319120 -0.267655 -0.198239 -0.135286 -0.145533 -0.186647 0.076660 0.095773 0.064340 0.094233 0.103892 0.100561 0.103279 0.109658 0.109881 0.101403 0.087844 0.096534 0.135538 0.145298 0.138679 0.139001 0.145113 0.146301 0.148015 0.088174 0.110453 0.093624 0.086150 0.089777 0.143198 0.156796 0.162060 0.162150 0.161547
qa: 0.4825 -0.2246 -0.3381 -0.3326 -0.2654 -0.1244 -0.1206 -0.4462 -0.4316 -0.0991 -0.2188 -0.1044 0.0731 -0.2167 -0.2918 0.3402 -0.2577 -0.2323 0.2373 -0.1315 0.1520 0.0399 -0.2708 0.3191 -0.2677 -0.1982 -0.1353 -0.1455 -0.1866 0.0767 0.0958 0.0643 0.0942 0.1039 0.1006 0.1033 0.1097 0.1099 0.1014 0.0878 0.0965 0.1355 0.1453 0.1387 0.1390 0.1451 0.1463 0.1480 0.0882 0.1105 0.0936 0.0862 0.0898 0.1432 0.1568 0.1621 0.1622 0.1615
va: 4.1331 1.0566 2.0480 2.0247 3.8321 3.8818 3.6698 3.9033 3.9108 3.8613 3.9267 3.8350 3.6139 3.8327 3.9811 3.6644 3.8791 3.8909 3.5380 3.8835 4.0134 3.7905 3.9653 3.6575 3.9484 3.9438 3.9149 3.8907 3.9073 1.0182 1.0113 1.0063 1.0083 1.0101 1.0111 1.0093 1.0084 1.0072 1.0082 1.0060 1.0053 0.9958 0.9868 1.0092 1.0091 1.0094 1.0008 0.9986 0.9973 0.9907 1.0063 1.0025 1.0041 1.0235 0.9966 0.9898 0.9887 0.9889
dispcorr: -0.036023331 hartree
energy: -1510.089846746126
dipole: -18.65408 17.88428 -0.76980 11.27953 -11.79010 -0.51057 -3.09596 2.45648 -0.63948
magnitude: 1.12348 au
magnitude: 2.85566 debye
