program: Orca
programVersion: 5.0.2
elementType: Si F O O C C C C C C C C C C C C C C C C C C C C C C C C C H H H H H H H H H H H H H H H H H H H H H H H H H H H H H
charge: 0
multiplicity: 1
keywords: wb97x-d3
keywords: def2-TZVPP
keywords: def2/J RIJCOSX
keywords: DEFGRID2
keywords: scfconv7
keywords: smallprint printgap noloewdin
keywords: NOSOSCF
formula: C25H29FO2Si
InChI: InChI=1/C25H29FO2Si/c1-4-27-21-13-15-23(16-14-21)29(2,3)18-8-9-20-12-17-24(26)25(19-20)28-22-10-6-5-7-11-22/h5-7,10-17,19H,4,8-9,18H2,1-3H3
58 atoms
Si -3.486974 1.724984 0.801549
F  1.709006 -5.359626 -0.056841
O  1.691708 4.347154 -0.93346
O  2.27569 -2.791887 -0.614847
C  -3.672586 0.249423 -0.368456
C  -2.59278 -0.804922 -0.144709
C  -1.868853 2.582949 0.35817
C  -3.4058 1.126152 2.583275
C  -4.926377 2.911247 0.567368
C  -2.496033 -1.839266 -1.26801
C  -1.830766 3.657134 -0.537326
C  -0.638615 2.116408 0.825043
C  -1.383849 -2.81555 -1.010747
C  -0.6382 4.223672 -0.953251
C  0.571504 2.664345 0.417823
C  0.577457 3.725801 -0.483268
C  -0.068026 -2.359927 -0.984129
C  -1.629885 -4.155968 -0.732095
C  0.972799 -3.20818 -0.649248
C  -0.590933 -5.024923 -0.425762
C  0.697662 -4.539764 -0.373886
C  2.967193 3.739256 -0.745931
C  3.17925 2.532464 -1.634363
C  2.622693 -1.723448 0.175523
C  1.863861 -1.295477 1.258678
C  3.819794 -1.093563 -0.141597
C  2.31482 -0.223405 2.01796
C  4.260313 -0.031352 0.63359
C  3.509282 0.414759 1.713143
H  -4.666884 -0.197115 -0.265442
H  -3.616378 0.628388 -1.39545
H  -2.768197 -1.320243 0.804101
H  -1.615167 -0.323089 -0.044915
H  -4.310903 0.577736 2.853102
H  -2.559923 0.458282 2.756667
H  -3.310012 1.96101 3.280298
H  -5.866498 2.432076 0.848709
H  -4.820084 3.807619 1.181193
H  -5.028084 3.232845 -0.47064
H  -3.444431 -2.371195 -1.37163
H  -2.322003 -1.316872 -2.213116
H  -2.753136 4.068713 -0.931885
H  -0.600128 1.292065 1.529375
H  -0.640687 5.053335 -1.649951
H  1.489548 2.248035 0.810887
H  0.14999 -1.321499 -1.208258
H  -2.644906 -4.531747 -0.749782
H  -0.782193 -6.068371 -0.211003
H  3.132146 3.491192 0.306754
H  3.683126 4.519486 -1.002382
H  2.514486 1.704412 -1.388562
H  3.034982 2.790212 -2.684086
H  4.203548 2.177891 -1.517369
H  0.934296 -1.781614 1.523722
H  4.402626 -1.436077 -0.987363
H  1.720484 0.11043 2.858611
H  5.19374 0.45495 0.381845
H  3.851894 1.249414 2.309911
elementType: Si F O C H
totalener: -1510.05195786 hartree
nucrepener: 2905.65993443 hartree
electener: -4415.71189229 hartree
oneelecener: -7840.93679011 hartree
twoeener: 3425.22489782 hartree
cpcmener: -0.02753143 hartree
kineticenergy: 1503.91263340 hartree
xcener: -135.233248113692 hartree
chargesum: -0.0000000
charge: 0.493466 -0.219540 -0.353897 -0.343667 -0.256988 -0.092622 -0.153449 -0.426080 -0.461734 -0.064808 -0.101108 -0.188552 0.001045 -0.272518 -0.207274 0.297350 -0.215765 -0.186120 0.194212 -0.176032 0.196679 0.057590 -0.275522 0.326455 -0.192596 -0.238995 -0.194151 -0.151741 -0.175440 0.085980 0.075307 0.089248 0.047441 0.108545 0.101557 0.109411 0.106644 0.106348 0.101525 0.080548 0.090401 0.139141 0.153165 0.134464 0.138104 0.150051 0.143858 0.150423 0.083806 0.109963 0.079234 0.104136 0.096523 0.157249 0.146399 0.166241 0.161854 0.164236
qa: 0.4935 -0.2195 -0.3539 -0.3437 -0.2570 -0.0926 -0.1534 -0.4261 -0.4617 -0.0648 -0.1011 -0.1886 0.0010 -0.2725 -0.2073 0.2973 -0.2158 -0.1861 0.1942 -0.1760 0.1967 0.0576 -0.2755 0.3265 -0.1926 -0.2390 -0.1942 -0.1517 -0.1754 0.0860 0.0753 0.0892 0.0474 0.1085 0.1016 0.1094 0.1066 0.1063 0.1015 0.0805 0.0904 0.1391 0.1532 0.1345 0.1381 0.1501 0.1439 0.1504 0.0838 0.1100 0.0792 0.1041 0.0965 0.1572 0.1464 0.1662 0.1619 0.1642
va: 4.1355 1.0661 2.0559 2.0712 3.8452 3.8815 3.7632 3.8838 3.9274 3.8101 3.8841 3.8875 3.6739 4.0401 3.8016 3.7849 3.9282 3.8927 3.6747 3.8719 4.0639 3.8355 3.9195 3.6614 3.8407 3.9511 3.8605 3.8495 3.8115 1.0143 1.0163 1.0054 1.0079 1.0069 1.0091 1.0083 1.0107 1.0093 1.0107 1.0146 1.0066 0.9872 0.9786 1.0147 1.0206 0.9970 1.0023 0.9975 0.9967 0.9934 1.0001 1.0096 1.0061 0.9986 1.0085 0.9885 0.9876 0.9884
dispcorr: -0.032543649 hartree
energy: -1510.084501506457
dipole: -17.67482 17.04409 -0.63073 24.93954 -24.59817 0.34137 3.05202 -2.76057 0.29145
magnitude: 0.77414 au
magnitude: 1.96770 debye
