program: Orca
programVersion: 5.0.2
elementType: Si F O O C C C C C C C C C C C C C C C C C C C C C C C C C H H H H H H H H H H H H H H H H H H H H H H H H H H H H H
charge: 0
multiplicity: 1
keywords: wb97x-d3
keywords: def2-TZVPP
keywords: def2/J RIJCOSX
keywords: DEFGRID2
keywords: scfconv7
keywords: smallprint printgap noloewdin
keywords: NOSOSCF
formula: C25H29FO2Si
InChI: InChI=1/C25H29FO2Si/c1-4-27-21-13-15-23(16-14-21)29(2,3)18-8-9-20-12-17-24(26)25(19-20)28-22-10-6-5-7-11-22/h5-7,10-17,19H,4,8-9,18H2,1-3H3
58 atoms
Si -2.756245 1.355033 0.357845
F  0.810466 -5.336788 0.779794
O  2.326394 4.534406 1.193138
O  1.672386 -3.283328 -0.72524
C  -2.269362 -0.110451 -0.7232
C  -3.404526 -1.065188 -1.080788
C  -1.196629 2.374692 0.62091
C  -3.40778 0.745036 2.011354
C  -4.055289 2.397906 -0.515537
C  -2.969704 -2.232383 -1.97972
C  -0.460971 2.829853 -0.473986
C  -0.694143 2.685399 1.888616
C  -1.959463 -3.116298 -1.308394
C  0.716437 3.55438 -0.33418
C  0.476271 3.405682 2.055539
C  1.194166 3.844786 0.942096
C  -0.602493 -2.818126 -1.386052
C  -2.358407 -4.202487 -0.532349
C  0.332049 -3.553289 -0.673358
C  -1.429832 -4.966456 0.158684
C  -0.095054 -4.624457 0.094877
C  3.136264 4.952785 0.098984
C  4.354173 5.643263 0.657399
C  2.092181 -1.990201 -0.514701
C  1.453648 -1.132337 0.373029
C  3.225298 -1.582214 -1.203682
C  1.956816 0.148711 0.555933
C  3.723263 -0.302423 -1.00052
C  3.089896 0.571172 -0.126748
H  -1.802672 0.268621 -1.640162
H  -1.47506 -0.644472 -0.190902
H  -4.198964 -0.520404 -1.59905
H  -3.859263 -1.469697 -0.170922
H  -3.666758 1.564846 2.684054
H  -4.312627 0.149201 1.871265
H  -2.681354 0.11207 2.524943
H  -4.334788 3.272132 0.075837
H  -3.691748 2.759114 -1.480078
H  -4.967558 1.827702 -0.704784
H  -3.849258 -2.819224 -2.254128
H  -2.553712 -1.828907 -2.906675
H  -0.800439 2.618229 -1.482651
H  -1.219495 2.356568 2.77805
H  1.242644 3.876617 -1.222539
H  0.845951 3.629292 3.049079
H  -0.268715 -1.988279 -1.998341
H  -3.408271 -4.458856 -0.464276
H  -1.738817 -5.814206 0.756643
H  2.574395 5.6332 -0.548982
H  3.430596 4.087391 -0.504292
H  4.989141 5.973206 -0.164823
H  4.086052 6.523163 1.242763
H  4.943435 4.974001 1.284711
H  0.575356 -1.447391 0.922099
H  3.714493 -2.259689 -1.89183
H  1.457594 0.817436 1.246221
H  4.607813 0.012771 -1.538445
H  3.475578 1.57133 0.023745
elementType: Si F O C H
totalener: -1510.05474435 hartree
nucrepener: 2899.38932392 hartree
electener: -4409.44406827 hartree
oneelecener: -7828.89602728 hartree
twoeener: 3419.45195901 hartree
cpcmener: -0.02822721 hartree
kineticenergy: 1503.91704791 hartree
xcener: -135.232834721776 hartree
chargesum: -0.0000000
charge: 0.510754 -0.220299 -0.340938 -0.347228 -0.225261 -0.147276 -0.184378 -0.448118 -0.427471 -0.093476 -0.144230 -0.091211 0.062492 -0.283805 -0.280585 0.348257 -0.252234 -0.218755 0.220209 -0.167800 0.181545 0.056653 -0.272724 0.301222 -0.208629 -0.247032 -0.176714 -0.131739 -0.195867 0.090465 0.055393 0.082239 0.081549 0.106727 0.107789 0.108463 0.105919 0.103988 0.102489 0.090779 0.088089 0.133713 0.141312 0.140643 0.132506 0.157025 0.145200 0.151128 0.106217 0.090518 0.090617 0.088059 0.087075 0.164099 0.148240 0.181511 0.159010 0.183879
qa: 0.5108 -0.2203 -0.3409 -0.3472 -0.2253 -0.1473 -0.1844 -0.4481 -0.4275 -0.0935 -0.1442 -0.0912 0.0625 -0.2838 -0.2806 0.3483 -0.2522 -0.2188 0.2202 -0.1678 0.1815 0.0567 -0.2727 0.3012 -0.2086 -0.2470 -0.1767 -0.1317 -0.1959 0.0905 0.0554 0.0822 0.0815 0.1067 0.1078 0.1085 0.1059 0.1040 0.1025 0.0908 0.0881 0.1337 0.1413 0.1406 0.1325 0.1570 0.1452 0.1511 0.1062 0.0905 0.0906 0.0881 0.0871 0.1641 0.1482 0.1815 0.1590 0.1839
va: 4.1028 1.0648 2.0483 2.0663 3.8208 3.9321 3.7546 3.9244 3.8943 3.8546 3.8659 3.8103 3.5992 3.8686 4.0220 3.6801 3.9115 3.9124 3.6561 3.8702 4.0781 3.7869 3.9712 3.6715 3.9017 4.0065 3.8531 3.9245 3.8814 1.0149 1.0310 1.0087 1.0029 1.0083 1.0090 1.0061 1.0092 1.0074 1.0074 1.0081 1.0095 0.9969 0.9893 1.0125 1.0157 0.9984 1.0013 0.9969 0.9902 0.9832 1.0056 1.0035 1.0033 0.9948 1.0064 0.9763 0.9901 0.9670
dispcorr: -0.032258136 hartree
energy: -1510.087002485748
dipole: -12.56952 11.77433 -0.79520 31.67747 -30.43922 1.23825 -2.97754 1.93915 -1.03839
magnitude: 1.80107 au
magnitude: 4.57796 debye
