program: Orca
programVersion: 5.0.2
elementType: Si F O O C C C C C C C C C C C C C C C C C C C C C C C C C H H H H H H H H H H H H H H H H H H H H H H H H H H H H H
charge: 0
multiplicity: 1
keywords: wb97x-d3
keywords: def2-TZVPP
keywords: def2/J RIJCOSX
keywords: DEFGRID2
keywords: scfconv7
keywords: smallprint printgap noloewdin
keywords: NOSOSCF
formula: C25H29FO2Si
InChI: InChI=1/C25H29FO2Si/c1-4-27-21-13-15-23(16-14-21)29(2,3)18-8-9-20-12-17-24(26)25(19-20)28-22-10-6-5-7-11-22/h5-7,10-17,19H,4,8-9,18H2,1-3H3
58 atoms
Si -3.687913 1.7293 0.66876
F  1.264663 -4.755387 -2.584992
O  1.945167 3.898235 0.227441
O  2.190548 -3.211506 -0.624192
C  -3.517635 -0.049275 1.287245
C  -2.61581 -0.892792 0.391463
C  -1.951405 2.44653 0.544201
C  -4.70161 2.739077 1.89132
C  -4.49402 1.751902 -1.031011
C  -2.403003 -2.321722 0.898475
C  -1.405574 2.897657 -0.661548
C  -1.125815 2.501691 1.667511
C  -1.435416 -3.055068 0.0152
C  -0.111194 3.380727 -0.74313
C  0.178285 2.97861 1.61195
C  0.693334 3.423063 0.396082
C  -0.06998 -2.815062 0.147354
C  -1.870441 -3.906257 -0.995506
C  0.839697 -3.382793 -0.729378
C  -0.96654 -4.495146 -1.870183
C  0.376122 -4.215869 -1.737422
C  2.845271 3.878317 1.329833
C  4.180341 4.38812 0.849019
C  2.710623 -1.958487 -0.413597
C  3.915397 -1.902962 0.273832
C  2.114633 -0.800118 -0.897126
C  4.529472 -0.676355 0.477195
C  2.73696 0.421085 -0.675979
C  3.942715 0.491427 0.008685
H  -3.114743 -0.030022 2.306383
H  -4.510455 -0.505445 1.366414
H  -1.637727 -0.410476 0.296971
H  -3.026566 -0.938568 -0.622052
H  -5.700957 2.319601 2.025269
H  -4.227297 2.768883 2.87457
H  -4.821447 3.770779 1.555042
H  -5.490186 1.306282 -0.987757
H  -4.611936 2.768186 -1.411854
H  -3.918849 1.188739 -1.768112
H  -2.022979 -2.285384 1.922931
H  -3.359691 -2.848015 0.930913
H  -1.997853 2.873921 -1.569003
H  -1.494584 2.160439 2.62934
H  0.288169 3.722546 -1.690388
H  0.771377 2.994886 2.516272
H  0.285602 -2.165036 0.938831
H  -2.927424 -4.111466 -1.109358
H  -1.304066 -5.155249 -2.658779
H  2.941431 2.859704 1.719149
H  2.465084 4.50874 2.140076
H  4.580545 3.770302 0.044469
H  4.113986 5.417128 0.494816
H  4.893299 4.364476 1.672655
H  4.369333 -2.814767 0.640744
H  1.181334 -0.835805 -1.444219
H  5.469973 -0.636712 1.010786
H  2.274542 1.322535 -1.056134
H  4.42414 1.446611 0.170757
elementType: Si F O C H
totalener: -1510.05544988 hartree
nucrepener: 2864.65900891 hartree
electener: -4374.71445879 hartree
oneelecener: -7759.36151749 hartree
twoeener: 3384.64705870 hartree
cpcmener: -0.02747669 hartree
kineticenergy: 1503.91684539 hartree
xcener: -135.230055089350 hartree
chargesum: -0.0000000
charge: 0.493967 -0.220813 -0.339025 -0.342637 -0.277586 -0.125336 -0.193416 -0.430212 -0.443979 -0.046306 -0.065622 -0.149661 0.021734 -0.299449 -0.229862 0.314730 -0.226871 -0.213177 0.209945 -0.164850 0.179012 0.030102 -0.284192 0.295723 -0.245653 -0.169495 -0.145016 -0.185454 -0.189133 0.083310 0.087606 0.073230 0.089269 0.103454 0.101733 0.102163 0.111460 0.108826 0.103172 0.086832 0.083782 0.143952 0.135262 0.135031 0.141411 0.148674 0.144560 0.150997 0.098178 0.116762 0.086219 0.096716 0.095974 0.147134 0.153924 0.158688 0.169712 0.184501
qa: 0.4940 -0.2208 -0.3390 -0.3426 -0.2776 -0.1253 -0.1934 -0.4302 -0.4440 -0.0463 -0.0656 -0.1497 0.0217 -0.2994 -0.2299 0.3147 -0.2269 -0.2132 0.2099 -0.1648 0.1790 0.0301 -0.2842 0.2957 -0.2457 -0.1695 -0.1450 -0.1855 -0.1891 0.0833 0.0876 0.0732 0.0893 0.1035 0.1017 0.1022 0.1115 0.1088 0.1032 0.0868 0.0838 0.1440 0.1353 0.1350 0.1414 0.1487 0.1446 0.1510 0.0982 0.1168 0.0862 0.0967 0.0960 0.1471 0.1539 0.1587 0.1697 0.1845
va: 4.1252 1.0637 2.0306 2.0669 3.8536 3.8438 3.7598 3.8989 3.9161 3.7877 3.8010 3.9010 3.6677 4.0111 3.8858 3.7116 3.9216 3.9056 3.6796 3.8699 4.0627 3.7842 3.9670 3.6886 3.9966 3.8851 3.9288 3.8871 3.8605 1.0160 1.0174 1.0069 1.0037 1.0089 1.0096 1.0084 1.0079 1.0075 1.0059 1.0098 1.0124 0.9875 0.9950 1.0147 1.0099 1.0033 1.0023 0.9971 0.9828 0.9909 1.0023 1.0042 1.0042 1.0074 1.0015 0.9912 0.9874 0.9695
dispcorr: -0.030372732 hartree
energy: -1510.085822613707
dipole: -15.95719 15.27715 -0.68004 29.08893 -28.20620 0.88273 14.43828 -13.08361 1.35467
magnitude: 1.75408 au
magnitude: 4.45852 debye
