program: Orca
programVersion: 5.0.2
elementType: Si F O O C C C C C C C C C C C C C C C C C C C C C C C C C H H H H H H H H H H H H H H H H H H H H H H H H H H H H H
charge: 0
multiplicity: 1
keywords: wb97x-d3
keywords: def2-TZVPP
keywords: def2/J RIJCOSX
keywords: DEFGRID2
keywords: scfconv7
keywords: smallprint printgap noloewdin
keywords: NOSOSCF
formula: C25H29FO2Si
InChI: InChI=1/C25H29FO2Si/c1-4-27-21-13-15-23(16-14-21)29(2,3)18-8-9-20-12-17-24(26)25(19-20)28-22-10-6-5-7-11-22/h5-7,10-17,19H,4,8-9,18H2,1-3H3
58 atoms
Si -2.684558 1.390033 0.388277
F  0.802174 -5.410052 0.680654
O  2.492785 4.382273 1.348548
O  1.686218 -3.319061 -0.749315
C  -2.210905 -0.084378 -0.691453
C  -3.360618 -1.01672 -1.062094
C  -1.10577 2.369151 0.688629
C  -3.377951 0.792467 2.031846
C  -3.940562 2.468157 -0.510673
C  -2.947901 -2.180784 -1.976121
C  -0.343894 2.823362 -0.388982
C  -0.609976 2.642784 1.966556
C  -1.945057 -3.089826 -1.326981
C  0.851884 3.508736 -0.22195
C  0.579836 3.324912 2.159715
C  1.327617 3.758274 1.064279
C  -0.584499 -2.801157 -1.392484
C  -2.35491 -4.197755 -0.590012
C  0.341649 -3.57043 -0.706037
C  -1.434816 -4.994898 0.07567
C  -0.097492 -4.664541 0.023431
C  3.288241 4.911481 0.292033
C  2.757467 6.224867 -0.242139
C  2.129944 -2.041598 -0.502255
C  1.501485 -1.193085 0.401386
C  3.278452 -1.639134 -1.169816
C  2.026768 0.07326 0.619361
C  3.798495 -0.374582 -0.931963
C  3.173271 0.490195 -0.043562
H  -1.728683 0.289395 -1.602328
H  -1.432639 -0.63437 -0.152374
H  -4.14556 -0.453104 -1.57427
H  -3.821694 -1.424413 -0.157166
H  -3.615866 1.619495 2.703358
H  -4.298559 0.224843 1.882199
H  -2.674048 0.137719 2.549343
H  -4.21364 3.345038 0.079447
H  -3.54391 2.825427 -1.463423
H  -4.860247 1.91994 -0.725731
H  -3.838308 -2.752872 -2.245809
H  -2.537384 -1.774139 -2.903777
H  -0.678464 2.642742 -1.405109
H  -1.156888 2.315864 2.843533
H  1.393816 3.830244 -1.100779
H  0.942053 3.518295 3.162272
H  -0.241937 -1.953915 -1.975019
H  -3.407114 -4.44707 -0.533604
H  -1.75398 -5.859767 0.642826
H  3.408452 4.175749 -0.508294
H  4.273124 5.061855 0.733297
H  3.44821 6.613126 -0.991142
H  1.781181 6.123432 -0.716012
H  2.677112 6.966873 0.552632
H  0.612967 -1.505948 0.934964
H  3.760817 -2.311171 -1.868283
H  1.534297 0.734749 1.321053
H  4.694366 -0.064505 -1.45384
H  3.575813 1.479073 0.134508
elementType: Si F O C H
totalener: -1510.05281900 hartree
nucrepener: 2904.07595050 hartree
electener: -4414.12876950 hartree
oneelecener: -7838.31230032 hartree
twoeener: 3424.18353082 hartree
cpcmener: -0.02822962 hartree
kineticenergy: 1503.90837672 hartree
xcener: -135.232869400880 hartree
chargesum: -0.0000000
charge: 0.512052 -0.220377 -0.352593 -0.346472 -0.228642 -0.145234 -0.179211 -0.449687 -0.428639 -0.096070 -0.157935 -0.094720 0.063104 -0.262364 -0.283719 0.338642 -0.255515 -0.216467 0.223214 -0.167732 0.180387 0.061498 -0.266821 0.305268 -0.211824 -0.249562 -0.177222 -0.127430 -0.194687 0.090755 0.057215 0.082045 0.081468 0.106871 0.108068 0.108593 0.106293 0.104166 0.102683 0.090078 0.089110 0.133883 0.141354 0.143765 0.132573 0.157225 0.144687 0.151373 0.079869 0.110588 0.095020 0.091624 0.088805 0.164145 0.148067 0.183609 0.159229 0.175597
qa: 0.5121 -0.2204 -0.3526 -0.3465 -0.2286 -0.1452 -0.1792 -0.4497 -0.4286 -0.0961 -0.1579 -0.0947 0.0631 -0.2624 -0.2837 0.3386 -0.2555 -0.2165 0.2232 -0.1677 0.1804 0.0615 -0.2668 0.3053 -0.2118 -0.2496 -0.1772 -0.1274 -0.1947 0.0908 0.0572 0.0820 0.0815 0.1069 0.1081 0.1086 0.1063 0.1042 0.1027 0.0901 0.0891 0.1339 0.1414 0.1438 0.1326 0.1572 0.1447 0.1514 0.0799 0.1106 0.0950 0.0916 0.0888 0.1641 0.1481 0.1836 0.1592 0.1756
va: 4.1009 1.0647 2.0351 2.0679 3.8194 3.9306 3.7486 3.9247 3.8935 3.8553 3.8651 3.8225 3.6006 3.8539 4.0346 3.6663 3.9138 3.9120 3.6543 3.8697 4.0781 3.8329 3.9311 3.6692 3.8984 4.0066 3.8490 3.9189 3.8804 1.0146 1.0301 1.0088 1.0031 1.0081 1.0090 1.0057 1.0090 1.0073 1.0076 1.0082 1.0090 0.9971 0.9892 1.0046 1.0158 0.9981 1.0014 0.9968 0.9972 0.9919 1.0079 1.0016 1.0054 0.9947 1.0065 0.9744 0.9897 0.9779
dispcorr: -0.032561960 hartree
energy: -1510.085380959841
dipole: -15.37145 14.53866 -0.83279 33.52765 -32.16685 1.36080 -4.26506 3.21656 -1.04850
magnitude: 1.90910 au
magnitude: 4.85255 debye
