program: Gaussian 09
title: 000062276
version: EM64L-G09RevD.01
frameworkgroup: C1[X(C19H15ClF3NO7)]
method: RPBEPBE
basis: SDD
operation: Freq
keyword: #p
keyword: freq=noraman
keyword: PBEPBE/SDD
title: #p freq=noraman PBEPBE/SDD
converged: YES YES NO NO
title: Mulliken charges:
elementType: Cl F F F O O O O O O O N C C C C C C C C C C C C C C C C C C C H H H H H H H H H H H H H H H
charge: 0.010134 -0.162756 -0.162536 -0.163514 -0.248570 -0.269855 -0.264800 -0.196883 -0.245448 -0.188562 -0.202767 0.027319 0.276669 -0.071174 0.378830 0.188585 -0.478480 -0.367831 0.151083 0.490187 -0.339354 0.314597 -0.697470 -0.322233 -0.308725 0.269731 -0.303582 -0.367740 0.263352 -0.226511 -0.669225 0.276586 0.330115 0.276383 0.293435 0.248355 0.238451 0.228577 0.282667 0.287575 0.271853 0.238264 0.231666 0.218175 0.229902 0.235524
chargesum: 0.00000
title: Mulliken charges with hydrogens summed into heavy atoms:
elementType: Cl F F F O O O O O O O N C C C C C C C C C C C C C C C C C C C
charge: 0.010134 -0.162756 -0.162536 -0.163514 -0.248570 -0.269855 -0.264800 -0.196883 -0.245448 -0.188562 -0.202767 0.027319 0.276669 0.205412 0.378830 0.188585 -0.148365 -0.091447 0.151083 0.490187 -0.045919 0.314597 0.017914 -0.322233 -0.026058 0.269731 -0.016007 -0.095887 0.263352 0.243419 0.014376
polarizability: 3.41069000e+02 -2.97448310e+01 2.86134735e+02 -2.01915188e+01 -1.66727719e+01 1.75878742e+02
1716.lowfreq: -17.7024 -4.9891 -2.4298 -0.0014 -0.0011 0.0010 4.7092 8.2296 9.5466
frequency: -17.6286 8.0167 9.2053 19.2369 22.8909 28.5342 30.0513 47.4541 61.8525 78.0543 87.3573 94.6617 103.1956 118.7485 130.9715 135.3000 141.6557 150.2737 164.9656 190.4903 195.0465 222.7622 227.7839 242.9317 252.1931 267.7160 280.8322 284.4764 313.1179 326.5024 345.4109 353.4005 354.7306 366.6764 382.1546 393.6386 426.9839 439.6661 445.5965 461.8489 472.5354 479.8475 530.9831 534.1083 585.9853 602.6640 613.7908 621.1021 645.1468 646.2522 662.7462 663.9213 681.5954 711.1507 717.0722 733.1506 741.3055 772.2866 780.6275 799.3135 807.0489 821.2240 834.5283 839.6205 849.6753 883.5744 884.0100 926.4124 931.3913 964.6706 984.7861 988.4874 1010.3541 1017.8513 1026.1278 1034.5249 1035.3192 1050.1613 1080.3623 1095.1226 1113.8512 1124.8183 1135.5896 1139.6529 1156.5211 1164.4503 1173.4285 1211.0112 1227.7116 1243.5874 1250.2565 1252.3479 1275.2501 1289.5717 1294.5210 1307.5324 1356.9817 1359.9640 1373.9979 1392.8245 1400.2208 1402.5861 1405.0817 1407.8644 1464.1810 1466.7226 1469.9736 1473.0531 1478.4884 1484.6333 1485.8760 1577.2942 1589.3915 1602.2807 1615.9289 1628.7295 1643.3735 2998.5014 3007.7332 3015.9341 3039.1441 3076.4406 3095.3577 3111.5248 3111.9947 3118.7814 3153.8507 3164.7496 3172.1140 3175.0058 3185.7153 3192.4998
redmass: 17.9863 7.4402 6.8835 5.9235 7.0882 4.8954 9.3362 3.4040 5.4838 9.4694 7.7844 10.1092 7.3064 2.3903 5.2706 10.0429 8.4353 6.2010 7.7964 4.6125 10.3231 1.2056 2.4384 8.4198 1.5789 5.0114 5.5542 10.1014 9.5424 9.3106 6.4123 4.4302 8.2647 8.0877 4.1844 9.4797 6.3414 3.8895 4.3655 5.9766 5.9810 7.9242 8.1208 7.6027 8.0190 9.4802 5.3763 5.8921 6.8436 6.3703 5.5152 8.7269 8.7705 4.6882 5.2283 5.7525 5.7467 8.7307 9.1732 1.1025 3.8487 3.5811 1.4669 6.1134 1.5119 1.4936 3.5762 1.7582 2.8334 1.4483 1.3337 6.8327 8.1762 2.2496 4.5400 2.8947 3.2468 3.6585 2.2956 2.6630 2.2588 2.7646 1.4748 1.6745 1.4222 2.2769 2.5865 5.8569 2.9806 2.8253 1.1386 1.9679 1.5230 2.2350 1.8446 1.4435 1.3889 8.6209 5.9874 1.2119 4.7616 1.2634 9.6095 4.5474 1.0399 1.0483 2.8511 1.0651 1.0570 3.0438 1.0699 8.0430 6.9354 8.1681 6.9532 10.7574 12.1791 1.0360 1.0351 1.0582 1.0840 1.1068 1.0985 1.1029 1.1013 1.1005 1.0937 1.0894 1.0934 1.0892 1.0969 1.0974
irintensity: 0.0154 0.4240 0.7227 0.6488 0.1779 0.8061 1.1827 0.1408 1.0245 1.3038 1.6945 1.1772 1.7885 2.7291 1.7202 1.5313 1.0651 3.3815 0.8474 3.5932 5.5434 0.3095 1.0582 2.8026 1.3584 10.5222 0.2820 1.0211 6.8674 15.7056 3.5929 5.2334 2.6525 10.2658 13.5160 1.6724 2.7597 10.9470 1.1244 3.7505 9.7608 3.4479 2.2552 3.6738 6.9985 26.4307 6.0207 9.4392 3.1072 10.8047 14.4898 5.8883 5.4706 12.2792 6.0778 15.2334 20.6052 15.5427 32.9599 4.2573 2.1063 1.4607 72.5860 9.6942 28.9256 32.2266 12.1535 48.6151 37.9585 17.1200 5.0895 198.4579 345.4885 81.4806 104.0645 48.2298 32.0307 107.4483 284.5796 36.4564 3.4209 43.2301 7.9620 31.8280 22.1417 355.5125 53.5416 583.0318 127.7838 129.6423 0.6652 282.0712 129.4767 295.3931 87.1559 30.7081 0.5182 151.5930 15.2028 15.9753 18.1864 23.6303 14.8019 47.2575 14.8428 12.2946 93.9007 3.9212 17.8733 54.3395 16.7810 6.7509 295.6421 101.0412 11.1430 195.2854 131.2218 18.5174 12.0341 12.4498 3.7148 4.1370 22.7138 24.5178 27.8792 12.7278 11.4018 2.3120 0.9315 0.4064 0.7546 2.9174
temp: 298.150 k
press: 1.00000 atm
elementType: 17 9 9 9 8 8 8 8 8 8 8 7 6 6 6 6 6 6 6 6 6 6 6 6 6 6 6 6 6 6 6 1 1 1 1 1 1 1 1 1 1 1 1 1 1 1
symmnumber: 1
zpe: 821392.6 jmol-1
zpe.correction: 0.312852 hartree
zpe.thermalcorrener: 0.342305 hartree
zpe.thermalcorrenthalpy: 0.343250 hartree
zpe.thermalcorrgfe: 0.246305 hartree
zpe.sumelectzpe: -2071.588118 hartree
zpe.sumelectthermal: -2071.558665 hartree
zpe.sumelectthermalent: -2071.557720 hartree
zpe.sumelectthermalfe: -2071.654665 hartree
dipole: -2.1709 2.4188 -1.8081
dipole: 3.7192
quadrupole: -234.0257 -156.3805 -181.9611
quadrupole: 12.5884 -7.9943 4.1550
quadrupole: -43.2366 34.4086 8.8280 12.5884 -7.9943 4.1550
hfenergy: -2071.9009699 hartree
pointgroup: C01 [X(C19H15Cl1F3N1O7)]
dipole: 0.8820486 -0.8491983 -0.8012464 debye
polarizability: 342.9722473|-29.6901187|279.8386972|16.4300391|27.7034813|180.2715331 unknown
InChI: InChI=1S/C19H15ClF3NO7/c1-3-29-17(25)10(2)30-18(26)13-9-12(5-6-15(13)24(27)28)31-16-7-4-11(8-14(16)20)19(21,22)23/h4-10H,3H2,1-2H3
charge 0 multiplicity 1
46 atoms
Cl 2.999059 2.996792 2.480797
F  5.056609 -1.363236 -1.868041
F  6.420187 0.192207 -0.933399
F  5.530353 -1.440996 0.351435
O  -2.647765 -1.119355 -0.771338
O  0.822597 2.894469 0.44693
O  -1.322516 -4.380078 0.212215
O  -3.206331 -0.945727 1.494411
O  -0.402691 -2.240943 0.328341
O  -5.157934 0.692334 -0.167721
O  -5.515399 2.940873 -0.004822
N  -4.741156 1.908137 -0.01698
C  -2.418054 1.014481 0.258944
C  -2.665844 -2.597327 -0.650075
C  -0.540329 2.567408 0.311424
C  -3.289059 2.122347 0.136336
C  -1.028475 1.241671 0.347409
C  -1.416327 3.674846 0.212381
C  -2.861427 -0.419034 0.417995
C  1.84335 1.972039 0.151993
C  -2.797509 3.448152 0.123396
C  4.043124 0.314517 -0.434497
C  -2.839952 -3.164905 -2.062229
C  2.974258 1.957042 1.005595
C  1.8287 1.161862 -1.005604
C  -1.337203 -3.012271 0.013587
C  4.074375 1.133825 0.719133
C  2.925004 0.329012 -1.296667
C  5.230408 -0.558417 -0.722064
C  -0.098832 -4.947142 0.87581
C  -0.323591 -6.448716 1.002446
H  -3.493923 -2.901612 0.015696
H  -0.36012 0.381584 0.456967
H  -1.0001 4.685314 0.204132
H  -3.507792 4.273558 0.032861
H  -3.799833 -2.821574 -2.481501
H  -2.838131 -4.26653 -2.02191
H  -2.025619 -2.827622 -2.725536
H  0.964916 1.189184 -1.675693
H  4.938015 1.127762 1.39023
H  2.910793 -0.300636 -2.189727
H  0.016188 -4.447134 1.853868
H  0.775879 -4.695566 0.249868
H  0.552031 -6.913944 1.49041
H  -0.456193 -6.915499 0.011642
H  -1.216041 -6.664453 1.613754
