program: Orca
programVersion: 5.0.2
elementType: Si F O O C C C C C C C C C C C C C C C C C C C C C C C C C H H H H H H H H H H H H H H H H H H H H H H H H H H H H H
charge: 0
multiplicity: 1
keywords: wb97x-d3
keywords: def2-TZVPP
keywords: def2/J RIJCOSX
keywords: DEFGRID2
keywords: scfconv7
keywords: smallprint printgap noloewdin
keywords: NOSOSCF
formula: C25H29FO2Si
InChI: InChI=1/C25H29FO2Si/c1-4-27-21-13-15-23(16-14-21)29(2,3)18-8-9-20-12-17-24(26)25(19-20)28-22-10-6-5-7-11-22/h5-7,10-17,19H,4,8-9,18H2,1-3H3
58 atoms
Si -2.885573 1.512927 -0.575743
F  3.101999 -1.885598 0.901909
O  1.208844 1.427578 3.879788
O  2.333855 -1.955401 -1.652993
C  -2.417391 0.191128 -1.84797
C  -2.848418 -1.250821 -1.565328
C  -1.658361 1.502502 0.851297
C  -4.626325 1.23136 0.079757
C  -2.766981 3.188236 -1.431611
C  -2.412557 -1.843208 -0.22736
C  -2.036718 1.274558 2.171506
C  -0.293508 1.712587 0.613547
C  -0.932105 -1.871799 0.051447
C  -1.117127 1.244962 3.216039
C  0.639524 1.689003 1.632417
C  0.232829 1.448379 2.947528
C  0.010998 -1.901329 -0.970048
C  -0.480461 -1.886627 1.370209
C  1.369621 -1.901049 -0.685496
C  0.872732 -1.906806 1.667786
C  1.78674 -1.895969 0.635445
C  0.866236 1.131127 5.228785
C  2.136051 1.127647 6.042729
C  2.198949 -1.190551 -2.785865
C  1.669759 0.093183 -2.758523
C  2.667916 -1.739908 -3.970104
C  1.601704 0.820478 -3.938107
C  2.603847 -0.995899 -5.139426
C  2.065052 0.283032 -5.131378
H  -2.859955 0.497089 -2.802245
H  -1.335383 0.249573 -2.010461
H  -2.502886 -1.897403 -2.377986
H  -3.939605 -1.306891 -1.597933
H  -4.932624 2.024357 0.76465
H  -5.3484 1.216448 -0.739362
H  -4.721021 0.282916 0.6121
H  -1.763474 3.363243 -1.825685
H  -3.461726 3.257982 -2.271314
H  -2.995593 4.007241 -0.747028
H  -2.900907 -1.306847 0.591058
H  -2.79821 -2.866071 -0.168141
H  -3.079375 1.106216 2.415888
H  0.061281 1.896572 -0.395452
H  -1.47242 1.059524 4.220636
H  1.689856 1.847524 1.419605
H  -0.305373 -1.916739 -2.00581
H  -1.197189 -1.868492 2.181504
H  1.217603 -1.906581 2.693756
H  0.371952 0.155859 5.285826
H  0.167558 1.880123 5.615042
H  1.898746 0.888338 7.079086
H  2.840925 0.378573 5.681326
H  2.625203 2.101659 6.029191
H  1.314357 0.529973 -1.833712
H  3.080289 -2.740705 -3.975245
H  1.186239 1.819165 -3.917694
H  2.971302 -1.425646 -6.061811
H  2.008403 0.85684 -6.046332
elementType: Si F O C H
totalener: -1510.05254501 hartree
nucrepener: 2991.47264394 hartree
electener: -4501.52518894 hartree
oneelecener: -8013.57296241 hartree
twoeener: 3512.04777347 hartree
cpcmener: -0.02980016 hartree
kineticenergy: 1503.90769711 hartree
xcener: -135.236796891658 hartree
chargesum: 0.0000000
charge: 0.478391 -0.222129 -0.342034 -0.344295 -0.229435 -0.150073 -0.112218 -0.441534 -0.457442 -0.078012 -0.150967 -0.125290 0.033515 -0.240632 -0.343910 0.374108 -0.224173 -0.220937 0.219572 -0.181654 0.198790 0.063843 -0.275670 0.278275 -0.177928 -0.234983 -0.178991 -0.136553 -0.170971 0.096909 0.045131 0.084716 0.091045 0.111569 0.113467 0.107212 0.101838 0.101979 0.101406 0.079616 0.100428 0.144734 0.151063 0.138424 0.130414 0.154953 0.142118 0.145004 0.094995 0.097651 0.090480 0.086912 0.087874 0.163440 0.147742 0.160210 0.160713 0.161295
qa: 0.4784 -0.2221 -0.3420 -0.3443 -0.2294 -0.1501 -0.1122 -0.4415 -0.4574 -0.0780 -0.1510 -0.1253 0.0335 -0.2406 -0.3439 0.3741 -0.2242 -0.2209 0.2196 -0.1817 0.1988 0.0638 -0.2757 0.2783 -0.1779 -0.2350 -0.1790 -0.1366 -0.1710 0.0969 0.0451 0.0847 0.0910 0.1116 0.1135 0.1072 0.1018 0.1020 0.1014 0.0796 0.1004 0.1447 0.1511 0.1384 0.1304 0.1550 0.1421 0.1450 0.0950 0.0977 0.0905 0.0869 0.0879 0.1634 0.1477 0.1602 0.1607 0.1613
va: 4.1035 1.0632 2.0492 2.0726 3.8484 3.9056 3.6498 3.9148 3.9029 3.8200 3.8465 3.8120 3.6404 3.8555 4.0038 3.6555 3.8864 3.8573 3.6648 3.8341 4.0558 3.7882 3.9733 3.7070 3.8491 3.9847 3.9098 3.8891 3.8863 1.0123 1.0228 1.0011 0.9981 1.0086 1.0088 1.0062 1.0103 1.0113 1.0096 1.0081 1.0029 0.9888 0.9767 1.0123 1.0165 0.9938 1.0010 1.0013 0.9856 0.9876 1.0055 1.0033 1.0029 0.9857 1.0071 0.9924 0.9881 0.9889
dispcorr: -0.034795246 hartree
energy: -1510.087340253542
dipole: -25.32796 23.41980 -1.90816 13.52441 -13.37044 0.15397 4.99932 -4.63117 0.36815
magnitude: 1.94944 au
magnitude: 4.95507 debye
