program: Orca
programVersion: 5.0.2
elementType: Si F O O C C C C C C C C C C C C C C C C C C C C C C C C C H H H H H H H H H H H H H H H H H H H H H H H H H H H H H
charge: 0
multiplicity: 1
keywords: wb97x-d3
keywords: def2-TZVPP
keywords: def2/J RIJCOSX
keywords: DEFGRID2
keywords: scfconv7
keywords: smallprint printgap noloewdin
keywords: NOSOSCF
formula: C25H29FO2Si
InChI: InChI=1/C25H29FO2Si/c1-4-27-21-13-15-23(16-14-21)29(2,3)18-8-9-20-12-17-24(26)25(19-20)28-22-10-6-5-7-11-22/h5-7,10-17,19H,4,8-9,18H2,1-3H3
58 atoms
Si -3.033094 1.581197 -0.390463
F  1.684551 -4.694469 -1.233272
O  2.452905 3.490651 1.342012
O  1.702736 -2.39248 0.165317
C  -3.04357 -0.304269 -0.571122
C  -3.291605 -1.080377 0.724137
C  -1.334402 2.16711 0.184885
C  -4.339457 2.100644 0.865449
C  -3.39908 2.36813 -2.060491
C  -3.222546 -2.596968 0.566037
C  -0.63469 1.515695 1.201466
C  -0.707535 3.279616 -0.389089
C  -1.897703 -3.14521 0.09905
C  0.623347 1.924848 1.626431
C  0.542035 3.711049 0.019828
C  1.224968 3.027566 1.026217
C  -0.696921 -2.492095 0.357548
C  -1.852998 -4.352331 -0.597804
C  0.507809 -3.009351 -0.09409
C  -0.653454 -4.892609 -1.033642
C  0.517768 -4.205351 -0.79118
C  3.173022 2.861812 2.397116
C  4.526414 3.51935 2.49798
C  1.977323 -1.173167 -0.399659
C  3.142332 -0.554543 0.041356
C  1.182684 -0.571311 -1.367161
C  3.516032 0.666512 -0.497145
C  1.565781 0.659807 -1.886293
C  2.72914 1.282996 -1.461767
H  -3.818778 -0.57133 -1.298381
H  -2.095995 -0.605486 -1.030366
H  -4.284261 -0.833093 1.10769
H  -2.598126 -0.766433 1.508652
H  -4.404537 3.187749 0.942824
H  -5.32981 1.732203 0.588942
H  -4.114396 1.716952 1.862531
H  -2.660448 2.084184 -2.812733
H  -4.376606 2.049518 -2.428477
H  -3.414423 3.458379 -2.009357
H  -3.476954 -3.063481 1.523181
H  -3.995785 -2.920749 -0.135708
H  -1.065729 0.652339 1.694912
H  -1.198779 3.831682 -1.182092
H  1.113834 1.371508 2.415546
H  1.004925 4.571811 -0.447582
H  -0.678949 -1.556098 0.903542
H  -2.774002 -4.882121 -0.807495
H  -0.627997 -5.830457 -1.573373
H  3.288406 1.792416 2.196345
H  2.623267 2.964219 3.338604
H  5.102724 3.390618 1.581297
H  4.4433 4.585285 2.711376
H  5.087945 3.060369 3.311263
H  3.75349 -1.033925 0.795807
H  0.275986 -1.040246 -1.726033
H  4.426132 1.141181 -0.153223
H  0.939869 1.129211 -2.634055
H  3.016977 2.241235 -1.87242
elementType: Si F O C H
totalener: -1510.05329715 hartree
nucrepener: 2989.04071269 hartree
electener: -4499.09400984 hartree
oneelecener: -8008.62377560 hartree
twoeener: 3509.52976576 hartree
cpcmener: -0.02997150 hartree
kineticenergy: 1503.90131130 hartree
xcener: -135.235995740259 hartree
chargesum: -0.0000000
charge: 0.491710 -0.219397 -0.341398 -0.341527 -0.275768 -0.113815 -0.165910 -0.425116 -0.456381 -0.112598 -0.196315 -0.091970 0.031807 -0.236571 -0.308575 0.361178 -0.242260 -0.195981 0.209773 -0.178445 0.201570 0.044844 -0.271601 0.356175 -0.260541 -0.234325 -0.138194 -0.181854 -0.164507 0.096875 0.078434 0.092657 0.082123 0.107827 0.107924 0.104119 0.108447 0.107807 0.101109 0.095271 0.085898 0.167831 0.141593 0.135915 0.131178 0.156508 0.143381 0.150946 0.090586 0.112091 0.084751 0.091354 0.091741 0.143545 0.164817 0.164066 0.161973 0.155224
qa: 0.4917 -0.2194 -0.3414 -0.3415 -0.2758 -0.1138 -0.1659 -0.4251 -0.4564 -0.1126 -0.1963 -0.0920 0.0318 -0.2366 -0.3086 0.3612 -0.2423 -0.1960 0.2098 -0.1784 0.2016 0.0448 -0.2716 0.3562 -0.2605 -0.2343 -0.1382 -0.1819 -0.1645 0.0969 0.0784 0.0927 0.0821 0.1078 0.1079 0.1041 0.1084 0.1078 0.1011 0.0953 0.0859 0.1678 0.1416 0.1359 0.1312 0.1565 0.1434 0.1509 0.0906 0.1121 0.0848 0.0914 0.0917 0.1435 0.1648 0.1641 0.1620 0.1552
va: 4.1058 1.0674 2.0342 2.0794 3.8508 3.8840 3.7286 3.8858 3.9189 3.8797 3.8236 3.7944 3.6402 3.8425 4.0323 3.6353 3.9117 3.9171 3.6753 3.8701 4.0654 3.7955 3.9664 3.6221 3.9583 3.8298 3.8425 3.8612 3.8238 1.0124 1.0132 1.0046 1.0030 1.0115 1.0049 1.0052 1.0079 1.0112 1.0102 1.0011 1.0045 0.9718 0.9868 1.0144 1.0165 1.0032 0.9992 0.9971 0.9808 0.9915 1.0047 1.0037 1.0054 1.0112 0.9964 0.9819 0.9923 0.9939
dispcorr: -0.035698945 hartree
energy: -1510.088996089929
dipole: -16.13433 14.97558 -1.15876 24.56830 -24.47218 0.09612 7.05893 -6.45372 0.60522
magnitude: 1.31082 au
magnitude: 3.33183 debye
