program: Gaussian 09
title: 000073447
version: EM64L-G09RevD.01
frameworkgroup: C1[X(C23H22O5)]
method: RPBEPBE
basis: SDD
operation: Freq
keyword: #pfreq=noraman
keyword: PBEPBE/SDD
title: #p freq=noraman PBEPBE/SDD
converged: YES YES NO NO
title: Mulliken charges:
elementType: O O O O O C C C C C C C C C C C C C C C C C C C C C C C H H H H H H H H H H H H H H H H H H H H H H
charge: -0.274781 -0.430764 -0.431319 -0.354724 -0.542805 0.207802 0.020258 -0.734851 0.070393 -0.482382 -0.557164 0.209819 0.228044 0.123098 0.366910 -0.553919 0.491831 0.186815 -0.350050 -0.415627 -0.416407 -0.393535 -0.248302 -0.212576 -0.231947 -0.231587 -0.245910 -0.532493 0.251689 0.269143 0.259677 0.260627 0.228578 0.227332 0.262080 0.273828 0.233060 0.233504 0.381051 0.219114 0.230333 0.420127 0.230370 0.221904 0.222063 0.225339 0.228381 0.248446 0.229810 0.379719
chargesum: 0.00000
title: Mulliken charges with hydrogens summed into heavy atoms:
elementType: O O O O O C C C C C C C C C C C C C C C C C C C C C C C
charge: -0.274781 -0.049713 -0.011191 -0.354724 -0.163086 0.207802 0.020258 -0.214019 0.070393 0.037922 -0.101254 0.209819 0.228044 0.123098 0.366910 -0.291839 0.491831 0.186815 -0.076222 -0.182567 -0.182903 -0.174421 -0.017970 0.017794 -0.010044 -0.009524 -0.020571 0.174144
polarizability: 3.81951398e+02 -6.34718469e+00 2.51389753e+02 9.40289688e+00 -5.01067593e-01 1.93578395e+02
1716.lowfreq: -11.8491 -5.5858 -3.2713 -0.0010 -0.0006 0.0004 6.5372 10.6630 24.6043
frequency: 3.7728 9.0201 24.5550 35.9284 37.3801 46.2072 75.1668 96.7430 113.1654 120.2496 132.5955 151.2541 168.9069 182.5996 202.1010 206.5661 229.8247 250.6630 267.1050 288.0414 298.9930 328.6840 341.9218 345.2233 355.1904 373.4739 403.1155 407.9195 416.1136 428.0923 444.2268 452.0666 496.9838 511.6955 524.3163 552.5490 556.7833 559.7226 572.4605 589.0734 612.9669 617.3106 624.2017 674.6221 679.8463 703.2212 706.6101 736.6763 742.4341 754.8249 759.4316 776.5125 786.2346 801.7663 816.6134 832.4157 842.0176 851.5247 852.5219 859.7224 902.7690 917.2290 941.6611 945.3687 974.1064 985.5863 986.8412 989.5315 991.5263 1012.9832 1026.3073 1036.8293 1058.7488 1065.1281 1069.6867 1081.3952 1083.6893 1111.9196 1131.5476 1141.9773 1147.8011 1162.6417 1170.6349 1170.9164 1184.0234 1186.1739 1194.3516 1216.4501 1217.1456 1225.0656 1229.3215 1254.3040 1262.1089 1293.1993 1311.6078 1316.3014 1325.9220 1327.5727 1374.8108 1381.1980 1383.4259 1391.7167 1411.2750 1416.7767 1429.6184 1438.9484 1439.8382 1451.8591 1462.5094 1467.9515 1470.4184 1473.7328 1477.3965 1483.4183 1491.1808 1569.0608 1583.6798 1591.9513 1598.5145 1613.9374 1622.0383 1643.9081 2358.2022 2970.7156 2997.1201 3006.9568 3013.9473 3037.2926 3063.9124 3073.8845 3076.6753 3112.4839 3113.3643 3113.4727 3116.6925 3129.2740 3129.6064 3138.1649 3140.6172 3151.6067 3159.7640 3168.9985 3192.4667 3616.3928
redmass: 3.7745 5.7626 4.4435 5.1764 5.4465 5.4186 4.8701 3.7382 4.6646 4.5034 4.8635 3.8401 4.5039 4.7934 2.9758 4.8739 5.2627 2.1414 3.1669 3.2320 4.2480 2.5662 4.4758 4.5778 1.4233 2.4412 2.8211 3.8661 7.2647 3.4190 5.0771 3.9381 4.7181 3.5471 5.0976 3.6384 3.9755 5.5382 6.7756 5.6836 5.7372 6.3510 3.4408 6.4075 4.0469 2.8633 2.1849 4.3981 2.8873 1.3555 1.9757 2.6483 1.6464 1.4208 2.8429 3.3125 2.0713 2.7907 1.2873 1.8827 2.3250 1.6713 3.2946 1.5859 1.3912 1.3290 1.9037 5.8857 1.3344 3.9453 2.2021 2.3149 3.2283 1.1129 4.0233 1.5574 2.8513 1.2580 3.4310 1.1589 1.3215 1.6227 1.0512 1.0929 1.5402 1.1166 1.6244 1.6359 2.4599 2.1116 2.3712 3.4920 1.1681 2.0672 1.4374 1.3888 1.2662 2.0001 2.6989 7.9988 2.3445 7.3078 2.7445 1.4653 1.5814 2.1837 2.2840 1.8483 1.9013 1.0504 1.1086 1.2770 1.2657 2.2989 2.0863 2.6943 5.3520 6.0645 6.3664 6.1739 6.7331 3.2054 1.0819 1.0320 1.0623 1.0626 1.0603 1.0966 1.1044 1.1023 1.0987 1.0859 1.0870 1.0854 1.0758 1.0909 1.1008 1.0876 1.0959 1.0939 1.1015 1.1006 1.0911 1.0660
irintensity: 0.0277 0.3218 0.2724 1.5655 0.0988 0.4028 4.7481 0.5298 0.0172 0.9235 4.5606 2.3563 0.5335 7.4583 4.1219 1.2986 2.8649 1.6626 3.7500 6.7702 13.1304 0.3029 5.3984 6.2960 107.0301 3.5159 0.0462 16.9107 6.1161 3.9867 11.6765 7.5262 32.0038 35.9683 14.9517 0.1373 1.9572 11.9631 8.1543 1.3189 12.4280 0.2169 11.1048 8.3715 16.5141 12.5636 47.0335 9.1340 1.0857 80.5421 36.6620 23.1178 42.0128 154.9086 6.9634 2.2547 4.9381 16.6191 0.8786 7.8126 8.7339 6.0094 5.5728 10.3780 0.0071 2.2448 3.6230 0.2879 0.0921 9.0742 7.4448 11.7111 10.4729 98.8598 56.1281 13.1400 167.8975 0.0345 92.8377 0.9034 45.2963 45.9654 0.1062 0.1015 16.1782 0.5157 55.4237 5.1318 6.1519 112.5327 77.8269 40.5467 0.7800 201.1614 55.4427 25.3828 1.0144 27.5526 132.3190 0.2954 90.0018 1.4488 24.3465 13.4875 158.1775 6.6645 42.9904 82.3225 56.8795 12.1284 15.1038 31.9765 54.3098 17.8459 46.4408 33.3802 273.4990 1.2127 33.5484 23.4074 2.0046 652.2264 672.4749 57.5546 13.6543 16.1975 15.6166 0.4517 32.9788 16.1841 1.7135 26.4261 61.7163 215.7618 986.8888 12.0513 8.3188 4.8648 48.7053 10.6517 26.6973 17.3808 1.9819 47.5434
temp: 298.150 k
press: 1.00000 atm
elementType: 8 8 8 8 8 6 6 6 6 6 6 6 6 6 6 6 6 6 6 6 6 6 6 6 6 6 6 6 1 1 1 1 1 1 1 1 1 1 1 1 1 1 1 1 1 1 1 1 1 1
symmnumber: 1
zpe: 1033771.4 jmol-1
zpe.correction: 0.393743 hartree
zpe.thermalcorrener: 0.418888 hartree
zpe.thermalcorrenthalpy: 0.419833 hartree
zpe.thermalcorrgfe: 0.334096 hartree
zpe.sumelectzpe: -1263.776078 hartree
zpe.sumelectthermal: -1263.750932 hartree
zpe.sumelectthermalent: -1263.749988 hartree
zpe.sumelectthermalfe: -1263.835724 hartree
dipole: 3.0250 3.6366 2.8381
dipole: 5.5163
quadrupole: -129.7592 -158.1170 -159.2028
quadrupole: -4.9541 7.9175 -1.4421
quadrupole: 19.2671 -9.0906 -10.1765 -4.9541 7.9175 -1.4421
hfenergy: -1264.1698205 hartree
pointgroup: C01 [X(C23H22O5)]
dipole: -1.3198524 0.4331943 -1.6674877 debye
polarizability: 379.9771329|18.9250717|234.3693448|-3.8779667|-28.0077066|212.5730676 unknown
InChI: InChI=1S/C23H22O5/c1-28-21-14-20(26)17(13-16-9-5-6-10-18(16)24)23(27)22(21)19(25)12-11-15-7-3-2-4-8-15/h2-10,14,24,26-27H,11-13H2,1H3
charge 0 multiplicity 1
50 atoms
O  1.28156 1.525847 -1.508944
O  -1.053137 -0.627007 2.180532
O  -3.491771 2.021152 -1.057857
O  1.360727 -0.89867 1.948564
O  -5.731985 0.77364 -0.321153
C  -2.310395 0.689081 0.639731
C  0.1829 0.424364 0.344872
C  -3.555253 0.427168 1.48156
C  -1.061751 0.158371 1.053122
C  2.784066 0.025535 0.231488
C  3.916461 -0.712023 0.9880
C  1.41616 -0.163587 0.868323
C  0.08662 1.26158 -0.828493
C  -2.331902 1.474731 -0.539447
C  -4.401399 -0.750279 1.000921
C  -1.143204 1.773295 -1.259935
C  5.263153 -0.475989 0.320135
C  -5.487013 -0.566517 0.110991
C  -4.127347 -2.075361 1.420179
C  5.723325 -1.331347 -0.714853
C  6.075357 0.627725 0.689734
C  -6.290568 -1.634309 -0.339306
C  -4.912045 -3.16513 0.979875
C  -5.998615 -2.944102 0.10282
C  6.955878 -1.091855 -1.363865
C  7.308838 0.872815 0.044584
C  7.753696 0.013644 -0.987104
C  1.222149 2.374515 -2.704723
H  -4.176305 1.341027 1.523831
H  -3.213018 0.209137 2.506593
H  2.739265 -0.303767 -0.824118
H  3.001671 1.108552 0.162606
H  3.932409 -0.365169 2.036689
H  3.680631 -1.790826 1.024809
H  -1.241629 2.394997 -2.151113
H  -3.279024 -2.234479 2.094787
H  5.113624 -2.195935 -1.007135
H  5.741074 1.29402 1.495217
H  -0.034108 -0.907016 2.330917
H  -7.12819 -1.45499 -1.026112
H  -4.67974 -4.179333 1.320737
H  -4.342194 1.621453 -0.677653
H  -6.615649 -3.781405 -0.240062
H  7.29624 -1.768157 -2.156678
H  7.924278 1.727334 0.34928
H  8.711868 0.199009 -1.485764
H  0.591286 1.913929 -3.488146
H  2.262893 2.443945 -3.053215
H  0.83785 3.382215 -2.458571
H  -6.531637 0.83167 -0.89645
