program: Orca
programVersion: 5.0.2
elementType: Si F O O C C C C C C C C C C C C C C C C C C C C C C C C C H H H H H H H H H H H H H H H H H H H H H H H H H H H H H
charge: 0
multiplicity: 1
keywords: wb97x-d3
keywords: def2-TZVPP
keywords: def2/J RIJCOSX
keywords: DEFGRID2
keywords: scfconv7
keywords: smallprint printgap noloewdin
keywords: NOSOSCF
formula: C25H29FO2Si
InChI: InChI=1/C25H29FO2Si/c1-4-27-21-13-15-23(16-14-21)29(2,3)18-8-9-20-12-17-24(26)25(19-20)28-22-10-6-5-7-11-22/h5-7,10-17,19H,4,8-9,18H2,1-3H3
58 atoms
Si -3.6719 1.352782 0.611732
F  1.233952 -3.912029 1.422961
O  2.200187 2.322457 1.714345
O  1.913097 -1.780143 0.029251
C  -3.707906 -0.308118 -0.283115
C  -2.969172 -0.296283 -1.621139
C  -1.854795 1.714826 0.952008
C  -4.61926 1.206468 2.231101
C  -4.400578 2.733307 -0.436519
C  -2.54377 -1.689195 -2.095883
C  -1.046298 0.757312 1.579203
C  -1.237047 2.902483 0.568884
C  -1.536334 -2.319166 -1.172809
C  0.297311 0.976515 1.817823
C  0.113705 3.147757 0.796137
C  0.888268 2.182432 1.43194
C  -0.26519 -1.757213 -1.052719
C  -1.856579 -3.423588 -0.391567
C  0.670377 -2.296154 -0.184346
C  -0.930157 -3.966803 0.490589
C  0.321542 -3.402945 0.580729
C  2.903995 3.442654 1.188175
C  4.359473 3.29282 1.553111
C  2.587875 -1.138175 -0.979955
C  2.640166 -1.636804 -2.275086
C  3.282201 0.010042 -0.631029
C  3.389479 -0.959568 -3.226717
C  4.034778 0.671501 -1.590749
C  4.087713 0.193625 -2.892651
H  -3.246128 -1.033405 0.397379
H  -4.736526 -0.654551 -0.422863
H  -2.074437 0.33221 -1.56389
H  -3.602066 0.160953 -2.385648
H  -5.6639 0.94355 2.051801
H  -4.195872 0.433111 2.874739
H  -4.608354 2.142449 2.792231
H  -5.453367 2.537683 -0.65044
H  -4.350714 3.697666 0.072918
H  -3.889143 2.841572 -1.394495
H  -3.421058 -2.335521 -2.174134
H  -2.119702 -1.609788 -3.100431
H  -1.467411 -0.193617 1.88801
H  -1.810645 3.676366 0.07189
H  0.898369 0.218611 2.305355
H  0.53715 4.09045 0.476917
H  -0.00884 -0.886242 -1.644345
H  -2.840978 -3.867836 -0.464292
H  -1.178968 -4.825526 1.100416
H  2.500377 4.37133 1.603592
H  2.782313 3.484412 0.100849
H  4.917809 4.141446 1.160016
H  4.501909 3.272978 2.633361
H  4.789189 2.384949 1.129015
H  2.110544 -2.540936 -2.546974
H  3.239912 0.376229 0.385501
H  3.430636 -1.34487 -4.236883
H  4.577904 1.56595 -1.3136
H  4.671888 0.712101 -3.640789
elementType: Si F O C H
totalener: -1510.05447846 hartree
nucrepener: 2966.28763281 hartree
electener: -4476.34211127 hartree
oneelecener: -7963.54333965 hartree
twoeener: 3487.20122837 hartree
cpcmener: -0.02740491 hartree
kineticenergy: 1503.92491296 hartree
xcener: -135.234714221440 hartree
chargesum: 0.0000000
charge: 0.486957 -0.222071 -0.341123 -0.340581 -0.266040 -0.132967 -0.192370 -0.424565 -0.447660 -0.089352 -0.102239 -0.114640 0.003634 -0.312803 -0.255392 0.360994 -0.209156 -0.203101 0.217197 -0.155544 0.173049 0.034431 -0.280300 0.307139 -0.205634 -0.261880 -0.139673 -0.117593 -0.198881 0.074947 0.092992 0.075355 0.091608 0.103240 0.101563 0.101670 0.111000 0.105889 0.107999 0.082512 0.099940 0.135215 0.144400 0.136556 0.140305 0.148189 0.143698 0.150297 0.113148 0.103366 0.096388 0.094776 0.084519 0.157031 0.150123 0.162345 0.160393 0.160701
qa: 0.4870 -0.2221 -0.3411 -0.3406 -0.2660 -0.1330 -0.1924 -0.4246 -0.4477 -0.0894 -0.1022 -0.1146 0.0036 -0.3128 -0.2554 0.3610 -0.2092 -0.2031 0.2172 -0.1555 0.1730 0.0344 -0.2803 0.3071 -0.2056 -0.2619 -0.1397 -0.1176 -0.1989 0.0749 0.0930 0.0754 0.0916 0.1032 0.1016 0.1017 0.1110 0.1059 0.1080 0.0825 0.0999 0.1352 0.1444 0.1366 0.1403 0.1482 0.1437 0.1503 0.1131 0.1034 0.0964 0.0948 0.0845 0.1570 0.1501 0.1623 0.1604 0.1607
va: 4.1280 1.0614 2.0451 2.0291 3.8429 3.8710 3.7399 3.8975 3.9189 3.8547 3.8098 3.8656 3.6772 3.9743 3.9360 3.6998 3.8509 3.8595 3.5908 3.8725 4.0671 3.7806 3.9655 3.7245 3.9290 3.9584 3.8806 3.8736 3.9393 1.0174 1.0155 1.0052 1.0074 1.0089 1.0090 1.0090 1.0083 1.0083 1.0054 1.0081 1.0039 0.9896 0.9880 1.0182 1.0099 1.0054 1.0022 0.9970 0.9896 0.9866 1.0047 1.0044 1.0005 0.9971 1.0242 0.9884 0.9859 0.9904
dispcorr: -0.033319685 hartree
energy: -1510.087798147531
dipole: -15.71708 15.10362 -0.61347 24.59820 -23.37564 1.22256 -5.53041 3.97817 -1.55223
magnitude: 2.06892 au
magnitude: 5.25877 debye
