program: Orca
programVersion: 5.0.2
elementType: Si F O O C C C C C C C C C C C C C C C C C C C C C C C C C H H H H H H H H H H H H H H H H H H H H H H H H H H H H H
charge: 0
multiplicity: 1
keywords: wb97x-d3
keywords: def2-TZVPP
keywords: def2/J RIJCOSX
keywords: DEFGRID2
keywords: scfconv7
keywords: smallprint printgap noloewdin
keywords: NOSOSCF
formula: C25H29FO2Si
InChI: InChI=1/C25H29FO2Si/c1-4-27-21-13-15-23(16-14-21)29(2,3)18-8-9-20-12-17-24(26)25(19-20)28-22-10-6-5-7-11-22/h5-7,10-17,19H,4,8-9,18H2,1-3H3
58 atoms
Si -3.420357 0.312885 1.679523
F  2.536529 -0.194946 -1.928786
O  1.299309 3.546348 -0.275431
O  1.709855 -2.719024 -1.297001
C  -3.391716 -1.106659 0.433042
C  -3.724069 -0.647483 -0.992176
C  -1.960644 1.401721 1.19833
C  -3.180392 -0.341708 3.426884
C  -5.020317 1.291644 1.540966
C  -2.955096 -1.402677 -2.080777
C  -0.657879 0.99292 1.483828
C  -2.100898 2.566044 0.435724
C  -1.48333 -1.091697 -2.053634
C  0.458721 1.683347 1.028977
C  -1.004924 3.270573 -0.032329
C  0.28664 2.825301 0.250281
C  -0.550586 -2.045784 -1.658253
C  -1.027367 0.182605 -2.388978
C  0.801764 -1.745319 -1.619029
C  0.322401 0.498177 -2.34887
C  1.224318 -0.472886 -1.969641
C  2.634798 3.088578 -0.091748
C  3.554617 4.016423 -0.844205
C  2.468704 -2.565859 -0.162811
C  3.656762 -3.283675 -0.113919
C  2.075823 -1.770058 0.904597
C  4.460241 -3.19322 1.012291
C  2.895685 -1.684729 2.022509
C  4.089473 -2.389278 2.083169
H  -2.379987 -1.527196 0.476934
H  -4.058828 -1.91984 0.732919
H  -3.524544 0.421475 -1.125299
H  -4.795599 -0.763641 -1.168092
H  -2.256717 -0.916422 3.520469
H  -3.138255 0.467195 4.158631
H  -4.001793 -1.001318 3.714549
H  -5.878646 0.672062 1.80921
H  -5.024868 2.158239 2.204827
H  -5.191068 1.655462 0.525859
H  -3.10888 -2.477947 -1.964545
H  -3.361314 -1.129441 -3.058159
H  -0.486803 0.098408 2.074166
H  -3.088699 2.937078 0.186829
H  1.443441 1.31095 1.278458
H  -1.142241 4.162583 -0.631588
H  -0.872086 -3.044327 -1.38679
H  -1.733899 0.944259 -2.694721
H  0.673493 1.48652 -2.616965
H  2.737929 2.06556 -0.465688
H  2.888176 3.079067 0.973107
H  3.335313 4.018058 -1.91219
H  3.487194 5.039096 -0.472468
H  4.584075 3.682901 -0.716386
H  3.948678 -3.903757 -0.952098
H  1.139321 -1.227529 0.883238
H  5.387257 -3.750386 1.046743
H  2.587998 -1.06151 2.852264
H  4.723509 -2.316328 2.9564
elementType: Si F O C H
totalener: -1510.05383081 hartree
nucrepener: 3014.89774367 hartree
electener: -4524.95157447 hartree
oneelecener: -8060.19858295 hartree
twoeener: 3535.24700848 hartree
cpcmener: -0.02671137 hartree
kineticenergy: 1503.91009217 hartree
xcener: -135.232105377172 hartree
chargesum: 0.0000000
charge: 0.480458 -0.222254 -0.342263 -0.341810 -0.257684 -0.124525 -0.137919 -0.446206 -0.430490 -0.093421 -0.154541 -0.103925 0.070673 -0.278592 -0.291594 0.354872 -0.258496 -0.267906 0.233795 -0.138330 0.216643 0.060453 -0.275036 0.249498 -0.221717 -0.150201 -0.141862 -0.187901 -0.170867 0.075773 0.094971 0.065416 0.093564 0.100943 0.104251 0.103967 0.109768 0.110123 0.100955 0.084805 0.099543 0.145425 0.145113 0.134729 0.132513 0.135385 0.146309 0.154127 0.084948 0.104364 0.087135 0.089071 0.091219 0.147623 0.146431 0.160288 0.160980 0.161405
qa: 0.4805 -0.2223 -0.3423 -0.3418 -0.2577 -0.1245 -0.1379 -0.4462 -0.4305 -0.0934 -0.1545 -0.1039 0.0707 -0.2786 -0.2916 0.3549 -0.2585 -0.2679 0.2338 -0.1383 0.2166 0.0605 -0.2750 0.2495 -0.2217 -0.1502 -0.1419 -0.1879 -0.1709 0.0758 0.0950 0.0654 0.0936 0.1009 0.1043 0.1040 0.1098 0.1101 0.1010 0.0848 0.0995 0.1454 0.1451 0.1347 0.1325 0.1354 0.1463 0.1541 0.0849 0.1044 0.0871 0.0891 0.0912 0.1476 0.1464 0.1603 0.1610 0.1614
va: 4.1372 1.0595 2.0482 2.0608 3.8226 3.8938 3.6914 3.9049 3.9076 3.8371 3.8497 3.8241 3.5786 3.8356 4.0313 3.6870 4.0006 3.8987 3.6873 3.8066 3.9633 3.7805 3.9735 3.7212 3.9738 3.8214 3.9065 3.9221 3.8830 1.0152 1.0109 1.0052 1.0084 1.0110 1.0097 1.0108 1.0085 1.0075 1.0085 1.0091 1.0034 0.9810 0.9858 1.0117 1.0153 1.0166 1.0028 0.9934 0.9905 0.9906 1.0034 1.0036 1.0054 1.0085 0.9997 0.9882 0.9923 0.9887
dispcorr: -0.035280605 hartree
energy: -1510.089111412266
dipole: -18.51554 17.98251 -0.53303 8.48229 -8.53841 -0.05612 11.95628 -11.53361 0.42267
magnitude: 0.68258 au
magnitude: 1.73499 debye
