program: Orca
programVersion: 5.0.2
elementType: Si F O O C C C C C C C C C C C C C C C C C C C C C C C C C H H H H H H H H H H H H H H H H H H H H H H H H H H H H H
charge: 0
multiplicity: 1
keywords: wb97x-d3
keywords: def2-TZVPP
keywords: def2/J RIJCOSX
keywords: DEFGRID2
keywords: scfconv7
keywords: smallprint printgap noloewdin
keywords: NOSOSCF
formula: C25H29FO2Si
InChI: InChI=1/C25H29FO2Si/c1-4-27-21-13-15-23(16-14-21)29(2,3)18-8-9-20-12-17-24(26)25(19-20)28-22-10-6-5-7-11-22/h5-7,10-17,19H,4,8-9,18H2,1-3H3
58 atoms
Si -4.094618 0.909022 0.985198
F  1.308221 -0.781171 -3.173302
O  1.654828 2.783296 0.75818
O  1.804392 -0.367534 -0.513336
C  -3.896453 -0.885911 0.434923
C  -2.987304 -1.692051 1.366846
C  -2.351042 1.616297 0.95613
C  -4.787583 1.006741 2.730366
C  -5.191536 1.842707 -0.223635
C  -2.245731 -2.837635 0.669996
C  -1.640298 1.893705 2.121356
C  -1.658129 1.76426 -0.251621
C  -1.279248 -2.334038 -0.366383
C  -0.30726 2.289238 2.106341
C  -0.332872 2.157338 -0.293319
C  0.360931 2.413665 0.891452
C  -0.1347 -1.63671 0.022466
C  -1.518952 -2.506456 -1.725033
C  0.736048 -1.117695 -0.918272
C  -0.649421 -1.994633 -2.681044
C  0.463447 -1.298248 -2.269051
C  2.475905 2.897495 1.918772
C  2.875196 1.558196 2.500663
C  3.070103 -0.751591 -0.872082
C  4.024262 0.254944 -0.943114
C  3.413311 -2.074231 -1.115992
C  5.334202 -0.069603 -1.26008
C  4.728539 -2.381547 -1.439668
C  5.693581 -1.387188 -1.514023
H  -4.866081 -1.38117 0.328369
H  -3.47369 -0.848667 -0.576076
H  -3.579876 -2.100813 2.188432
H  -2.237502 -1.048307 1.838961
H  -4.861976 2.037575 3.082173
H  -5.791386 0.578288 2.769786
H  -4.174514 0.458014 3.447978
H  -6.198525 1.421435 -0.254119
H  -5.284963 2.895266 0.0504
H  -4.793313 1.803201 -1.239761
H  -1.706987 -3.421281 1.421058
H  -2.964974 -3.513188 0.200999
H  -2.123181 1.796895 3.087176
H  -2.155627 1.558735 -1.193746
H  0.185746 2.483656 3.049084
H  0.178291 2.255054 -1.243583
H  0.080898 -1.481043 1.073575
H  -2.400259 -3.044428 -2.050443
H  -0.844045 -2.125659 -3.737691
H  1.992145 3.527399 2.670583
H  3.361894 3.433416 1.58005
H  3.511852 1.725924 3.37012
H  2.020795 0.967513 2.830802
H  3.444723 0.96724 1.783371
H  3.739939 1.282261 -0.752827
H  2.676595 -2.8653 -1.051447
H  6.074883 0.717336 -1.314851
H  4.996416 -3.412402 -1.630993
H  6.715614 -1.636099 -1.765929
elementType: Si F O C H
totalener: -1510.05189797 hartree
nucrepener: 3000.84843631 hartree
electener: -4510.90033428 hartree
oneelecener: -8033.41710336 hartree
twoeener: 3522.51676908 hartree
cpcmener: -0.02874988 hartree
kineticenergy: 1503.92356708 hartree
xcener: -135.235616665303 hartree
chargesum: -0.0000000
charge: 0.497230 -0.220935 -0.355969 -0.328124 -0.265508 -0.127398 -0.168988 -0.441447 -0.438823 -0.095376 -0.135928 -0.123253 0.044497 -0.248220 -0.296706 0.348991 -0.256947 -0.187471 0.145382 -0.158837 0.260548 0.036185 -0.280219 0.313712 -0.298571 -0.187409 -0.119269 -0.159509 -0.189375 0.094154 0.075065 0.094477 0.069867 0.109505 0.110204 0.103159 0.103731 0.102994 0.100459 0.098821 0.085034 0.147204 0.134564 0.142964 0.134235 0.139021 0.147589 0.149600 0.101153 0.115450 0.104522 0.094946 0.090698 0.150538 0.155462 0.160840 0.161505 0.159977
qa: 0.4972 -0.2209 -0.3560 -0.3281 -0.2655 -0.1274 -0.1690 -0.4414 -0.4388 -0.0954 -0.1359 -0.1233 0.0445 -0.2482 -0.2967 0.3490 -0.2569 -0.1875 0.1454 -0.1588 0.2605 0.0362 -0.2802 0.3137 -0.2986 -0.1874 -0.1193 -0.1595 -0.1894 0.0942 0.0751 0.0945 0.0699 0.1095 0.1102 0.1032 0.1037 0.1030 0.1005 0.0988 0.0850 0.1472 0.1346 0.1430 0.1342 0.1390 0.1476 0.1496 0.1012 0.1154 0.1045 0.0949 0.0907 0.1505 0.1555 0.1608 0.1615 0.1600
va: 4.1326 1.0618 2.0297 2.0075 3.8398 3.8667 3.7239 3.9162 3.8996 3.8551 3.8484 3.8333 3.6105 3.8982 3.9786 3.6897 3.9248 3.8564 3.6077 3.9138 3.9784 3.8228 3.9234 3.6172 3.9647 3.9032 3.8953 3.9099 3.9027 1.0129 1.0144 1.0070 1.0068 1.0079 1.0086 1.0062 1.0101 1.0090 1.0104 1.0050 1.0072 0.9886 0.9929 1.0032 1.0150 1.0127 1.0002 0.9980 0.9980 0.9909 1.0123 1.0011 0.9977 1.0188 1.0010 0.9896 0.9894 0.9893
dispcorr: -0.034736202 hartree
energy: -1510.086634171133
dipole: -18.06703 17.67845 -0.38858 2.71055 -3.64626 -0.93571 20.53823 -19.39067 1.14756
magnitude: 1.53083 au
magnitude: 3.89106 debye
