program: Orca
programVersion: 5.0.2
elementType: Si F O O C C C C C C C C C C C C C C C C C C C C C C C C C H H H H H H H H H H H H H H H H H H H H H H H H H H H H H
charge: 0
multiplicity: 1
keywords: wb97x-d3
keywords: def2-TZVPP
keywords: def2/J RIJCOSX
keywords: DEFGRID2
keywords: scfconv7
keywords: smallprint printgap noloewdin
keywords: NOSOSCF
formula: C25H29FO2Si
InChI: InChI=1/C25H29FO2Si/c1-4-27-21-13-15-23(16-14-21)29(2,3)18-8-9-20-12-17-24(26)25(19-20)28-22-10-6-5-7-11-22/h5-7,10-17,19H,4,8-9,18H2,1-3H3
58 atoms
Si -3.106874 -0.50242 0.941699
F  2.99779 1.114285 -0.831422
O  1.255347 3.50156 2.206159
O  2.369266 -1.237682 -1.938126
C  -2.915293 -0.863863 -0.903524
C  -3.131474 0.363481 -1.801721
C  -1.766863 0.733032 1.416801
C  -2.850947 -2.088862 1.922272
C  -4.799884 0.235371 1.302369
C  -2.150093 0.452699 -2.977996
C  -0.475009 0.301802 1.717719
C  -1.98188 2.11568 1.432989
C  -0.740724 0.651061 -2.49377
C  0.562086 1.180006 2.004784
C  -0.965618 3.011744 1.714092
C  0.323352 2.552378 1.991017
C  0.173368 -0.395682 -2.498657
C  -0.349623 1.875008 -1.950305
C  1.434469 -0.244278 -1.935813
C  0.912458 2.045802 -1.406861
C  1.785753 0.977335 -1.388348
C  2.593861 3.13171 2.515784
C  2.774207 2.721462 3.96139
C  2.057187 -2.47393 -1.44472
C  2.839233 -3.529932 -1.896134
C  1.04734 -2.69114 -0.515315
C  2.603963 -4.8091 -1.416051
C  0.818034 -3.979818 -0.052086
C  1.589376 -5.04374 -0.497058
H  -1.901847 -1.261986 -1.028396
H  -3.580854 -1.67771 -1.206918
H  -3.046232 1.295724 -1.232981
H  -4.15205 0.355539 -2.191271
H  -2.860456 -1.907395 2.998979
H  -3.638337 -2.814832 1.70657
H  -1.900295 -2.570785 1.681625
H  -4.906398 0.507649 2.354594
H  -4.996125 1.133607 0.712788
H  -5.593044 -0.478727 1.069192
H  -2.215308 -0.453849 -3.584586
H  -2.440938 1.286702 -3.622127
H  -0.248757 -0.758577 1.741136
H  -2.966667 2.516056 1.218584
H  1.53956 0.773396 2.226452
H  -1.159998 4.077866 1.711358
H  -0.102786 -1.349789 -2.933161
H  -1.041686 2.708241 -1.943205
H  1.212948 2.994445 -0.980577
H  3.183966 4.02518 2.310032
H  2.948882 2.354957 1.832107
H  3.830024 2.521017 4.149122
H  2.462473 3.519041 4.636821
H  2.21826 1.819825 4.21943
H  3.625693 -3.347941 -2.617984
H  0.44024 -1.873486 -0.14893
H  3.215391 -5.628523 -1.77163
H  0.027594 -4.145347 0.669247
H  1.403555 -6.044897 -0.131222
elementType: Si F O C H
totalener: -1510.06603058 hartree
nucrepener: 3022.17912461 hartree
electener: -4532.24515519 hartree
oneelecener: -8074.63873692 hartree
twoeener: 3542.39358173 hartree
cpcmener: -0.02345604 hartree
kineticenergy: 1503.90533170 hartree
xcener: -135.234264262720 hartree
chargesum: -0.0000000
charge: 0.452021 -0.222551 -0.336596 -0.333031 -0.235682 -0.132420 -0.129286 -0.417835 -0.433666 -0.096248 -0.190286 -0.097264 0.099412 -0.219506 -0.288024 0.341151 -0.268154 -0.278297 0.272819 -0.138528 0.168641 0.059320 -0.263787 0.263245 -0.221831 -0.133905 -0.141521 -0.193310 -0.162304 0.060998 0.098511 0.066005 0.092044 0.106245 0.105088 0.082158 0.106813 0.099804 0.105448 0.084680 0.095596 0.136836 0.139935 0.135512 0.130013 0.147059 0.141458 0.150289 0.107646 0.073468 0.093600 0.088370 0.090546 0.144263 0.117886 0.157226 0.162070 0.157858
qa: 0.4520 -0.2226 -0.3366 -0.3330 -0.2357 -0.1324 -0.1293 -0.4178 -0.4337 -0.0962 -0.1903 -0.0973 0.0994 -0.2195 -0.2880 0.3412 -0.2682 -0.2783 0.2728 -0.1385 0.1686 0.0593 -0.2638 0.2632 -0.2218 -0.1339 -0.1415 -0.1933 -0.1623 0.0610 0.0985 0.0660 0.0920 0.1062 0.1051 0.0822 0.1068 0.0998 0.1054 0.0847 0.0956 0.1368 0.1399 0.1355 0.1300 0.1471 0.1415 0.1503 0.1076 0.0735 0.0936 0.0884 0.0905 0.1443 0.1179 0.1572 0.1621 0.1579
va: 4.1395 1.0584 2.0592 2.0865 3.8196 3.9016 3.6562 3.9097 3.9147 3.8525 3.8900 3.8282 3.5566 3.8283 4.0421 3.6755 3.9713 3.9018 3.6509 3.7965 4.0341 3.8425 3.9273 3.7569 3.9625 3.8405 3.9146 3.9265 3.8961 1.0145 1.0106 1.0047 1.0103 1.0108 1.0115 1.0151 1.0087 1.0106 1.0100 1.0094 1.0062 0.9786 0.9851 1.0062 1.0159 1.0039 1.0052 0.9936 0.9930 1.0079 1.0083 1.0054 1.0026 1.0088 1.0026 0.9890 0.9894 0.9910
dispcorr: -0.035918264 hartree
energy: -1510.101948844386
dipole: -21.88278 21.11716 -0.76562 -2.95789 2.47727 -0.48062 12.57514 -12.50874 0.06639
magnitude: 0.90641 au
magnitude: 2.30391 debye
