program: Orca
programVersion: 5.0.2
elementType: Si F O O C C C C C C C C C C C C C C C C C C C C C C C C C H H H H H H H H H H H H H H H H H H H H H H H H H H H H H
charge: 0
multiplicity: 1
keywords: wb97x-d3
keywords: def2-TZVPP
keywords: def2/J RIJCOSX
keywords: DEFGRID2
keywords: scfconv7
keywords: smallprint printgap noloewdin
keywords: NOSOSCF
formula: C25H29FO2Si
InChI: InChI=1/C25H29FO2Si/c1-4-27-21-13-15-23(16-14-21)29(2,3)18-8-9-20-12-17-24(26)25(19-20)28-22-10-6-5-7-11-22/h5-7,10-17,19H,4,8-9,18H2,1-3H3
58 atoms
Si -4.180525 1.505818 0.68086
F  2.16392 -3.886638 -0.701821
O  1.805899 2.336827 1.018141
O  1.877625 -1.441861 0.494203
C  -4.562823 -0.321289 1.072884
C  -3.391373 -1.291733 0.925413
C  -2.321946 1.808788 0.747633
C  -5.018206 2.580027 1.982316
C  -4.833059 1.962135 -1.02471
C  -2.888652 -1.428507 -0.513511
C  -1.573652 2.108641 -0.388612
C  -1.615155 1.696309 1.952217
C  -1.550317 -2.10738 -0.594695
C  -0.194401 2.28939 -0.350464
C  -0.245497 1.869818 2.017187
C  0.480614 2.171895 0.861649
C  -0.431193 -1.467638 -0.061644
C  -1.382949 -3.357325 -1.177578
C  0.814387 -2.062043 -0.096322
C  -0.132999 -3.966067 -1.224522
C  0.950563 -3.316821 -0.678474
C  2.594994 2.726783 -0.099397
C  3.994714 3.002711 0.391209
C  2.939218 -1.055771 -0.276075
C  2.845711 -0.83698 -1.644418
C  4.140754 -0.856954 0.392118
C  3.973561 -0.422475 -2.341278
C  5.255164 -0.438555 -0.317411
C  5.179908 -0.21999 -1.687155
H  -4.936714 -0.370621 2.100908
H  -5.401163 -0.645444 0.445294
H  -3.672009 -2.283505 1.293435
H  -2.569273 -0.95953 1.564779
H  -4.882378 3.644153 1.778281
H  -6.093536 2.389877 2.021942
H  -4.621196 2.386553 2.981523
H  -5.917673 1.832984 -1.058987
H  -4.626496 3.00343 -1.28082
H  -4.414401 1.336812 -1.816101
H  -3.623359 -1.973694 -1.110897
H  -2.801686 -0.437538 -0.969006
H  -2.06422 2.203838 -1.350895
H  -2.140323 1.464383 2.872938
H  0.329092 2.514341 -1.270116
H  0.275455 1.77647 2.962733
H  -0.526321 -0.490491 0.397421
H  -2.235027 -3.873123 -1.602691
H  -0.006497 -4.942472 -1.674812
H  2.176266 3.625678 -0.564459
H  2.597587 1.933604 -0.854264
H  4.015793 3.844216 1.084685
H  4.426593 2.133633 0.887164
H  4.632021 3.252207 -0.457334
H  1.910587 -0.974696 -2.172964
H  4.199061 -1.030638 1.459406
H  3.899044 -0.2536 -3.407912
H  6.189567 -0.285767 0.207327
H  6.053389 0.102646 -2.238143
elementType: Si F O C H
totalener: -1510.06925038 hartree
nucrepener: 2979.39131267 hartree
electener: -4489.46056305 hartree
oneelecener: -7989.34530301 hartree
twoeener: 3499.88473996 hartree
cpcmener: -0.02212349 hartree
kineticenergy: 1503.91450616 hartree
xcener: -135.233844058229 hartree
chargesum: -0.0000000
charge: 0.488497 -0.217465 -0.325153 -0.321072 -0.292037 -0.114171 -0.109946 -0.453380 -0.432396 -0.103612 -0.176968 -0.142450 -0.001688 -0.225996 -0.248472 0.324035 -0.128027 -0.139626 0.072287 -0.190261 0.287265 0.029714 -0.297373 0.288499 -0.167231 -0.245181 -0.167905 -0.151387 -0.161087 0.099726 0.084812 0.091827 0.081398 0.100157 0.101961 0.099888 0.109341 0.107525 0.102870 0.095039 0.085744 0.144254 0.135373 0.135313 0.130036 0.068149 0.138798 0.146509 0.120491 0.095233 0.101234 0.090663 0.094744 0.149221 0.141308 0.157046 0.157117 0.156807
qa: 0.4885 -0.2175 -0.3252 -0.3211 -0.2920 -0.1142 -0.1099 -0.4534 -0.4324 -0.1036 -0.1770 -0.1425 -0.0017 -0.2260 -0.2485 0.3240 -0.1280 -0.1396 0.0723 -0.1903 0.2873 0.0297 -0.2974 0.2885 -0.1672 -0.2452 -0.1679 -0.1514 -0.1611 0.0997 0.0848 0.0918 0.0814 0.1002 0.1020 0.0999 0.1093 0.1075 0.1029 0.0950 0.0857 0.1443 0.1354 0.1353 0.1300 0.0681 0.1388 0.1465 0.1205 0.0952 0.1012 0.0907 0.0947 0.1492 0.1413 0.1570 0.1571 0.1568
va: 4.0668 1.0687 2.0516 2.0540 3.8672 3.8434 3.6810 3.9011 3.8996 3.7604 3.8760 3.8709 3.6630 3.8539 4.0037 3.7230 3.8476 3.8725 3.8551 3.9339 3.9543 3.7742 3.9645 3.5790 3.8215 3.9541 3.9062 3.8731 3.8485 1.0066 1.0102 1.0087 1.0078 1.0116 1.0095 1.0117 1.0105 1.0080 1.0100 1.0143 1.0197 0.9903 0.9928 1.0128 1.0157 1.0368 1.0036 1.0001 0.9944 0.9793 1.0069 1.0024 1.0048 1.0049 1.0117 0.9913 0.9898 0.9900
dispcorr: -0.034688745 hartree
energy: -1510.103939127163
dipole: -20.25036 19.59329 -0.65707 21.88369 -21.39229 0.49141 0.55333 -1.64687 -1.09354
magnitude: 1.36713 au
magnitude: 3.47496 debye
