program: Orca
programVersion: 5.0.2
elementType: Si F O O C C C C C C C C C C C C C C C C C C C C C C C C C H H H H H H H H H H H H H H H H H H H H H H H H H H H H H
charge: 0
multiplicity: 1
keywords: wb97x-d3
keywords: def2-TZVPP
keywords: def2/J RIJCOSX
keywords: DEFGRID2
keywords: scfconv7
keywords: smallprint printgap noloewdin
keywords: NOSOSCF
formula: C25H29FO2Si
InChI: InChI=1/C25H29FO2Si/c1-4-27-21-13-15-23(16-14-21)29(2,3)18-8-9-20-12-17-24(26)25(19-20)28-22-10-6-5-7-11-22/h5-7,10-17,19H,4,8-9,18H2,1-3H3
58 atoms
Si -3.018579 1.217724 0.885991
F  1.404616 -4.680443 -0.3905
O  2.206908 4.239703 1.289322
O  1.368423 -2.665459 -2.224411
C  -2.753957 -0.038088 -0.499985
C  -3.795864 -1.148954 -0.594584
C  -1.427574 2.214952 1.02488
C  -3.332743 0.302564 2.503443
C  -4.468162 2.359882 0.522346
C  -3.476418 -2.204184 -1.665243
C  -0.191643 1.56072 1.117891
C  -1.398629 3.60715 1.031781
C  -2.184925 -2.917779 -1.382432
C  0.999476 2.253405 1.205941
C  -0.211804 4.329157 1.12196
C  1.000234 3.650112 1.206596
C  -0.99095 -2.486703 -1.956435
C  -2.137878 -3.965838 -0.466968
C  0.214777 -3.078722 -1.622354
C  -0.936359 -4.572745 -0.127309
C  0.22872 -4.121385 -0.707982
C  2.289142 5.658094 1.298378
C  3.746834 6.036182 1.388469
C  2.330892 -2.050559 -1.472178
C  3.586561 -1.942711 -2.05818
C  2.095614 -1.528579 -0.206845
C  4.610906 -1.313221 -1.369683
C  3.136424 -0.908647 0.473032
C  4.395048 -0.796657 -0.098151
H  -2.683515 0.496973 -1.454093
H  -1.763196 -0.476049 -0.338543
H  -4.78024 -0.725706 -0.814786
H  -3.894215 -1.655044 0.370875
H  -2.545127 -0.423463 2.718212
H  -3.375924 0.994182 3.347708
H  -4.279776 -0.241579 2.483075
H  -4.633518 3.082123 1.324469
H  -4.328773 2.920501 -0.404271
H  -5.39254 1.787144 0.415836
H  -4.295502 -2.926551 -1.705927
H  -3.4303 -1.723333 -2.645606
H  -0.146403 0.476502 1.118655
H  -2.323082 4.169672 0.963225
H  1.941524 1.7219 1.269644
H  -0.255635 5.41018 1.120675
H  -0.989905 -1.673522 -2.672949
H  -3.052314 -4.319527 -0.006262
H  -0.904944 -5.390248 0.581781
H  1.734778 6.064146 2.151379
H  1.843562 6.070557 0.386783
H  3.839977 7.122163 1.400447
H  4.20531 5.652327 2.300528
H  4.310576 5.662809 0.532766
H  3.755824 -2.351446 -3.046718
H  1.119703 -1.592559 0.257509
H  5.587327 -1.234494 -1.830209
H  2.952074 -0.511148 1.463039
H  5.199135 -0.313092 0.440385
elementType: Si F O C H
totalener: -1510.07084546 hartree
nucrepener: 2839.33419603 hartree
electener: -4349.40504149 hartree
oneelecener: -7708.99323164 hartree
twoeener: 3359.58819015 hartree
cpcmener: -0.02477149 hartree
kineticenergy: 1503.91815851 hartree
xcener: -135.229427921408 hartree
chargesum: -0.0000000
charge: 0.496063 -0.216687 -0.323649 -0.330118 -0.235346 -0.145634 -0.213674 -0.425894 -0.448961 -0.091796 -0.080138 -0.121148 0.037734 -0.284170 -0.260732 0.339203 -0.247315 -0.187016 0.180376 -0.178164 0.246006 0.063652 -0.273288 0.310788 -0.243740 -0.193541 -0.122443 -0.190359 -0.182310 0.090126 0.063494 0.084253 0.080450 0.105844 0.108279 0.102525 0.103479 0.107200 0.107113 0.093973 0.086308 0.134322 0.140078 0.124085 0.135966 0.137379 0.143481 0.148419 0.093040 0.091994 0.088555 0.086951 0.087618 0.143431 0.155491 0.156201 0.165977 0.156267
qa: 0.4961 -0.2167 -0.3236 -0.3301 -0.2353 -0.1456 -0.2137 -0.4259 -0.4490 -0.0918 -0.0801 -0.1211 0.0377 -0.2842 -0.2607 0.3392 -0.2473 -0.1870 0.1804 -0.1782 0.2460 0.0637 -0.2733 0.3108 -0.2437 -0.1935 -0.1224 -0.1904 -0.1823 0.0901 0.0635 0.0843 0.0805 0.1058 0.1083 0.1025 0.1035 0.1072 0.1071 0.0940 0.0863 0.1343 0.1401 0.1241 0.1360 0.1374 0.1435 0.1484 0.0930 0.0920 0.0886 0.0870 0.0876 0.1434 0.1555 0.1562 0.1660 0.1563
va: 4.1091 1.0698 2.0858 2.0778 3.8360 3.9054 3.8543 3.8730 3.9241 3.8435 3.8641 3.8686 3.6102 4.0261 3.8923 3.8293 3.9672 3.9038 3.7097 3.9226 3.9915 3.7997 3.9746 3.6752 3.9892 3.8430 3.9053 3.9102 3.9050 1.0143 1.0268 1.0113 1.0007 1.0062 1.0097 1.0052 1.0083 1.0083 1.0101 1.0068 1.0107 0.9837 0.9897 1.0326 1.0137 1.0136 1.0008 0.9990 0.9864 0.9864 1.0061 1.0035 1.0034 1.0095 1.0052 0.9889 0.9833 0.9911
dispcorr: -0.029099905 hartree
energy: -1510.099945363459
dipole: -16.52949 15.39633 -1.13316 29.81168 -28.56398 1.24770 9.66200 -9.30355 0.35845
magnitude: 1.72316 au
magnitude: 4.37993 debye
