program: Orca
programVersion: 5.0.2
elementType: Si F O O C C C C C C C C C C C C C C C C C C C C C C C C C H H H H H H H H H H H H H H H H H H H H H H H H H H H H H
charge: 0
multiplicity: 1
keywords: wb97x-d3
keywords: def2-TZVPP
keywords: def2/J RIJCOSX
keywords: DEFGRID2
keywords: scfconv7
keywords: smallprint printgap noloewdin
keywords: NOSOSCF
formula: C25H29FO2Si
InChI: InChI=1/C25H29FO2Si/c1-4-27-21-13-15-23(16-14-21)29(2,3)18-8-9-20-12-17-24(26)25(19-20)28-22-10-6-5-7-11-22/h5-7,10-17,19H,4,8-9,18H2,1-3H3
58 atoms
Si -0.943118 1.785614 -0.01883
F  -1.366377 -5.379001 -2.514031
O  -0.290513 4.921425 5.116798
O  0.860253 -4.006624 -3.056424
C  0.11998 0.226428 0.087694
C  -0.088115 -0.581628 1.366732
C  -0.734012 2.785867 1.562209
C  -2.749966 1.297787 -0.219835
C  -0.381888 2.80499 -1.499721
C  0.679843 -1.909841 1.403156
C  0.536386 3.125974 2.027596
C  -1.819123 3.201856 2.34061
C  0.173675 -2.886005 0.380156
C  0.734955 3.83788 3.20432
C  -1.648591 3.913458 3.514813
C  -0.3662 4.236329 3.960496
C  0.789295 -3.000838 -0.861502
C  -0.963468 -3.650988 0.633675
C  0.270114 -3.837289 -1.839846
C  -1.482275 -4.502732 -0.329376
C  -0.868343 -4.57683 -1.562594
C  0.988005 5.22984 5.656701
C  0.780564 5.961082 6.959633
C  1.224367 -2.910472 -3.7896
C  2.325721 -3.059154 -4.621614
C  0.518946 -1.713564 -3.754633
C  2.723893 -1.99975 -5.423019
C  0.937035 -0.659098 -4.554599
C  2.038233 -0.79297 -5.388824
H  -0.1125 -0.381404 -0.794659
H  1.177794 0.494933 -0.013639
H  -1.152525 -0.790392 1.517425
H  0.223576 0.014684 2.228549
H  -2.881017 0.692871 -1.120363
H  -3.117142 0.705598 0.620876
H  -3.404622 2.165913 -0.320867
H  0.655236 3.130963 -1.392803
H  -0.446365 2.229845 -2.426739
H  -0.992924 3.700837 -1.628547
H  1.743811 -1.716641 1.243336
H  0.586114 -2.34538 2.401152
H  1.417425 2.826719 1.468804
H  -2.83149 2.965701 2.033052
H  1.745985 4.066469 3.514147
H  -2.507706 4.220268 4.099599
H  1.684446 -2.427331 -1.073765
H  -1.453447 -3.58468 1.597487
H  -2.364081 -5.09839 -0.130148
H  1.556248 5.852732 4.957577
H  1.560392 4.310787 5.822216
H  0.23687 6.895074 6.813769
H  0.235973 5.350404 7.680572
H  1.749784 6.204764 7.39522
H  2.862914 -3.999219 -4.641587
H  -0.349743 -1.595278 -3.119173
H  3.582649 -2.119589 -6.070947
H  0.388603 0.273773 -4.524438
H  2.357052 0.034172 -6.009139
elementType: Si F O C H
totalener: -1510.07139081 hartree
nucrepener: 2743.79517043 hartree
electener: -4253.86656124 hartree
oneelecener: -7517.38677837 hartree
twoeener: 3263.52021712 hartree
cpcmener: -0.02410876 hartree
kineticenergy: 1503.90767504 hartree
xcener: -135.227697447203 hartree
chargesum: 0.0000000
charge: 0.479714 -0.217531 -0.324951 -0.330905 -0.239440 -0.142062 -0.163584 -0.433173 -0.417668 -0.091253 -0.185429 -0.087925 0.059977 -0.234885 -0.286158 0.338473 -0.248261 -0.220235 0.221095 -0.169694 0.184688 0.062317 -0.272078 0.294611 -0.247688 -0.202648 -0.120382 -0.147947 -0.190553 0.056855 0.090484 0.086853 0.084155 0.108254 0.104857 0.106111 0.100917 0.096255 0.102739 0.083857 0.095670 0.134551 0.139372 0.136921 0.133465 0.151230 0.143169 0.147684 0.092095 0.093009 0.086894 0.086914 0.089003 0.145135 0.159851 0.157516 0.162089 0.157665
qa: 0.4797 -0.2175 -0.3250 -0.3309 -0.2394 -0.1421 -0.1636 -0.4332 -0.4177 -0.0913 -0.1854 -0.0879 0.0600 -0.2349 -0.2862 0.3385 -0.2483 -0.2202 0.2211 -0.1697 0.1847 0.0623 -0.2721 0.2946 -0.2477 -0.2026 -0.1204 -0.1479 -0.1906 0.0569 0.0905 0.0869 0.0842 0.1083 0.1049 0.1061 0.1009 0.0963 0.1027 0.0839 0.0957 0.1346 0.1394 0.1369 0.1335 0.1512 0.1432 0.1477 0.0921 0.0930 0.0869 0.0869 0.0890 0.1451 0.1599 0.1575 0.1621 0.1577
va: 4.1453 1.0689 2.0819 2.0824 3.8296 3.8862 3.7788 3.9115 3.8975 3.8457 3.9146 3.8527 3.5999 3.8766 4.0441 3.7613 3.9113 3.9147 3.6600 3.8830 4.0750 3.8014 3.9750 3.7027 3.9996 3.8836 3.8870 3.8903 3.9143 1.0318 1.0132 1.0007 1.0118 1.0090 1.0070 1.0080 1.0096 1.0106 1.0094 1.0116 1.0058 0.9964 0.9894 1.0126 1.0145 1.0023 1.0013 0.9983 0.9855 0.9869 1.0034 1.0037 1.0058 1.0082 0.9964 0.9888 0.9898 0.9911
dispcorr: -0.027942849 hartree
energy: -1510.099333660067
dipole: 3.10573 -2.14736 0.95837 34.89935 -33.63569 1.26366 21.50151 -20.37992 1.12160
magnitude: 1.94250 au
magnitude: 4.93743 debye
