program: Orca
programVersion: 5.0.2
elementType: Si F O O C C C C C C C C C C C C C C C C C C C C C C C C C H H H H H H H H H H H H H H H H H H H H H H H H H H H H H
charge: 0
multiplicity: 1
keywords: wb97x-d3
keywords: def2-TZVPP
keywords: def2/J RIJCOSX
keywords: DEFGRID2
keywords: scfconv7
keywords: smallprint printgap noloewdin
keywords: NOSOSCF
formula: C25H29FO2Si
InChI: InChI=1/C25H29FO2Si/c1-4-27-21-13-15-23(16-14-21)29(2,3)18-8-9-20-12-17-24(26)25(19-20)28-22-10-6-5-7-11-22/h5-7,10-17,19H,4,8-9,18H2,1-3H3
58 atoms
Si -3.382327 1.73199 0.868293
F  1.447378 -5.615066 -0.57767
O  2.103566 4.042188 -0.229144
O  2.123657 -3.041184 -0.925033
C  -3.621671 0.33195 -0.383423
C  -2.609619 -0.797226 -0.212073
C  -1.693963 2.511102 0.565638
C  -3.433174 1.042315 2.619209
C  -4.729281 3.021783 0.621203
C  -2.605402 -1.799666 -1.36849
C  -1.543624 3.6520 -0.220652
C  -0.517965 1.937114 1.067667
C  -1.537926 -2.845042 -1.199072
C  -0.299373 4.202189 -0.510714
C  0.730274 2.462191 0.79094
C  0.851269 3.602139 -0.006299
C  -0.198797 -2.462331 -1.177054
C  -1.845332 -4.190163 -1.020394
C  0.804679 -3.388934 -0.952912
C  -0.845997 -5.134734 -0.82507
C  0.468622 -4.723717 -0.782714
C  2.29957 5.182633 -1.054086
C  3.782684 5.442564 -1.14668
C  2.538542 -2.08339 -0.039485
C  1.874936 -1.815133 1.152171
C  3.697692 -1.394182 -0.372251
C  2.378412 -0.840691 2.003175
C  4.191149 -0.428705 0.492209
C  3.533453 -0.141975 1.681047
H  -4.643101 -0.058149 -0.31513
H  -3.531516 0.762601 -1.387711
H  -2.800647 -1.331077 0.723754
H  -1.602636 -0.379515 -0.117314
H  -3.334777 1.835244 3.363895
H  -4.377472 0.528277 2.813582
H  -2.632681 0.323208 2.805766
H  -5.712234 2.597731 0.839689
H  -4.597163 3.887254 1.273692
H  -4.762619 3.386842 -0.407423
H  -3.58429 -2.278011 -1.451325
H  -2.443871 -1.256501 -2.304666
H  -2.416574 4.147098 -0.63177
H  -0.566612 1.052421 1.693464
H  -0.250953 5.090273 -1.126617
H  1.62317 1.992712 1.186672
H  0.072521 -1.422535 -1.32401
H  -2.87894 -4.512809 -1.035353
H  -1.088763 -6.181095 -0.689899
H  1.787029 6.052002 -0.628508
H  1.880463 5.006079 -2.050609
H  4.311512 4.599154 -1.592014
H  3.957838 6.315273 -1.776102
H  4.21656 5.6466 -0.167157
H  0.97715 -2.35295 1.428605
H  4.207739 -1.614183 -1.30198
H  1.857909 -0.632079 2.929318
H  5.093457 0.107441 0.227263
H  3.917097 0.617577 2.349482
elementType: Si F O C H
totalener: -1510.07124717 hartree
nucrepener: 2841.77095864 hartree
electener: -4351.84220581 hartree
oneelecener: -7713.77272480 hartree
twoeener: 3361.93051899 hartree
cpcmener: -0.02392247 hartree
kineticenergy: 1503.91152594 hartree
xcener: -135.228890510825 hartree
chargesum: -0.0000000
charge: 0.491342 -0.216797 -0.323049 -0.333291 -0.252696 -0.096139 -0.151682 -0.423875 -0.459282 -0.067146 -0.141204 -0.140652 -0.001797 -0.259135 -0.255858 0.327977 -0.198722 -0.178645 0.170039 -0.178319 0.204507 0.063024 -0.273772 0.297445 -0.176811 -0.244017 -0.181171 -0.110824 -0.196172 0.084579 0.075100 0.087726 0.052587 0.109133 0.107027 0.099445 0.105150 0.106448 0.099986 0.078939 0.090283 0.136372 0.146305 0.136373 0.134422 0.146518 0.140660 0.147522 0.091824 0.093287 0.087197 0.088960 0.087403 0.151827 0.145106 0.160713 0.157194 0.158634
qa: 0.4913 -0.2168 -0.3230 -0.3333 -0.2527 -0.0961 -0.1517 -0.4239 -0.4593 -0.0671 -0.1412 -0.1407 -0.0018 -0.2591 -0.2559 0.3280 -0.1987 -0.1786 0.1700 -0.1783 0.2045 0.0630 -0.2738 0.2974 -0.1768 -0.2440 -0.1812 -0.1108 -0.1962 0.0846 0.0751 0.0877 0.0526 0.1091 0.1070 0.0994 0.1052 0.1064 0.1000 0.0789 0.0903 0.1364 0.1463 0.1364 0.1344 0.1465 0.1407 0.1475 0.0918 0.0933 0.0872 0.0890 0.0874 0.1518 0.1451 0.1607 0.1572 0.1586
va: 4.1397 1.0703 2.0856 2.0789 3.8383 3.8771 3.7632 3.8836 3.9277 3.8124 3.9267 3.8844 3.6851 3.8937 4.0013 3.8314 3.9184 3.8947 3.7027 3.8839 4.0612 3.7989 3.9747 3.6829 3.8346 4.0015 3.8577 3.8848 3.8646 1.0145 1.0168 1.0055 1.0097 1.0081 1.0070 1.0098 1.0111 1.0096 1.0107 1.0148 1.0056 0.9911 0.9808 1.0127 1.0306 1.0017 1.0031 0.9987 0.9860 0.9864 1.0035 1.0059 1.0035 1.0015 1.0079 0.9905 0.9884 0.9902
dispcorr: -0.029058003 hartree
energy: -1510.100305173682
dipole: -17.51212 16.38189 -1.13023 34.66956 -33.13623 1.53333 3.91439 -4.15936 -0.24497
magnitude: 1.92056 au
magnitude: 4.88167 debye
