program: Orca
programVersion: 5.0.2
elementType: Si F O O C C C C C C C C C C C C C C C C C C C C C C C C C H H H H H H H H H H H H H H H H H H H H H H H H H H H H H
charge: 0
multiplicity: 1
keywords: wb97x-d3
keywords: def2-TZVPP
keywords: def2/J RIJCOSX
keywords: DEFGRID2
keywords: scfconv7
keywords: smallprint printgap noloewdin
keywords: NOSOSCF
formula: C25H29FO2Si
InChI: InChI=1/C25H29FO2Si/c1-4-27-21-13-15-23(16-14-21)29(2,3)18-8-9-20-12-17-24(26)25(19-20)28-22-10-6-5-7-11-22/h5-7,10-17,19H,4,8-9,18H2,1-3H3
58 atoms
Si -3.610227 1.601719 0.993242
F  1.746905 -4.501125 -1.712936
O  1.978027 2.6250 -1.114663
O  2.047517 -1.873675 -1.255053
C  -3.753396 -0.167165 1.685726
C  -2.696347 -1.159457 1.205197
C  -1.863169 1.926713 0.364254
C  -3.99743 2.813449 2.382704
C  -4.827445 1.850122 -0.421178
C  -2.746025 -1.438982 -0.298527
C  -0.775578 2.006802 1.23532
C  -1.586809 2.086374 -0.997332
C  -1.572051 -2.264911 -0.7399
C  0.520475 2.240472 0.791738
C  -0.304707 2.320322 -1.463797
C  0.763762 2.404441 -0.570999
C  -0.313572 -1.67342 -0.824831
C  -1.688232 -3.624176 -1.01109
C  0.804954 -2.425361 -1.141577
C  -0.577546 -4.3847 -1.352252
C  0.660415 -3.780822 -1.401866
C  3.04126 3.113472 -0.303995
C  2.857101 4.562475 0.091873
C  2.641986 -1.28801 -0.173225
C  3.800924 -0.566415 -0.43971
C  2.170715 -1.404943 1.128694
C  4.491406 0.030058 0.60243
C  2.868435 -0.787959 2.159807
C  4.027917 -0.070416 1.908419
H  -3.709347 -0.105738 2.778161
H  -4.75615 -0.547253 1.458425
H  -2.803625 -2.109624 1.738396
H  -1.702202 -0.782616 1.463523
H  -3.27221 2.739499 3.196431
H  -3.991201 3.848119 2.033731
H  -4.982943 2.619697 2.81322
H  -5.851006 1.700466 -0.068598
H  -4.776032 2.85826 -0.837566
H  -4.667601 1.144147 -1.239009
H  -3.681097 -1.946697 -0.548119
H  -2.747334 -0.496445 -0.852503
H  -0.924683 1.888812 2.303645
H  -2.388884 2.035239 -1.725169
H  1.319501 2.295304 1.519555
H  -0.123214 2.447968 -2.524462
H  -0.198519 -0.611786 -0.629513
H  -2.658303 -4.102807 -0.958678
H  -0.671686 -5.441746 -1.566133
H  3.93245 3.005051 -0.922246
H  3.188873 2.481534 0.574694
H  2.7506 5.201919 -0.785281
H  1.988516 4.714295 0.733846
H  3.735945 4.898077 0.644207
H  4.161542 -0.484242 -1.457531
H  1.275733 -1.968212 1.357423
H  5.395807 0.584944 0.388076
H  2.49448 -0.879086 3.171597
H  4.565289 0.404284 2.71872
elementType: Si F O C H
totalener: -1510.06663791 hartree
nucrepener: 2983.77578666 hartree
electener: -4493.84242458 hartree
oneelecener: -7997.89872304 hartree
twoeener: 3504.05629846 hartree
cpcmener: -0.02281869 hartree
kineticenergy: 1503.90176660 hartree
xcener: -135.232338128998 hartree
chargesum: -0.0000000
charge: 0.491808 -0.216604 -0.344645 -0.327765 -0.292985 -0.102746 -0.111781 -0.455476 -0.429916 -0.088896 -0.171271 -0.123316 0.015949 -0.238406 -0.275643 0.335204 -0.170850 -0.173994 0.183483 -0.181725 0.209066 0.053336 -0.262193 0.330829 -0.246584 -0.196904 -0.143624 -0.170614 -0.180075 0.098179 0.085700 0.092628 0.069608 0.099679 0.100068 0.102650 0.107801 0.108064 0.102930 0.094155 0.083501 0.135582 0.142957 0.142699 0.131020 0.081042 0.138964 0.147036 0.111533 0.070638 0.091688 0.090831 0.093640 0.141249 0.150769 0.158760 0.157372 0.155594
qa: 0.4918 -0.2166 -0.3446 -0.3278 -0.2930 -0.1027 -0.1118 -0.4555 -0.4299 -0.0889 -0.1713 -0.1233 0.0159 -0.2384 -0.2756 0.3352 -0.1708 -0.1740 0.1835 -0.1817 0.2091 0.0533 -0.2622 0.3308 -0.2466 -0.1969 -0.1436 -0.1706 -0.1801 0.0982 0.0857 0.0926 0.0696 0.0997 0.1001 0.1026 0.1078 0.1081 0.1029 0.0942 0.0835 0.1356 0.1430 0.1427 0.1310 0.0810 0.1390 0.1470 0.1115 0.0706 0.0917 0.0908 0.0936 0.1412 0.1508 0.1588 0.1574 0.1556
va: 4.0660 1.0718 2.0319 2.0889 3.8736 3.8525 3.6924 3.9000 3.8986 3.7538 3.8767 3.8367 3.6457 3.8153 4.0404 3.6652 3.9076 3.8924 3.6948 3.8849 4.0497 3.8492 3.9496 3.6407 3.9148 3.8382 3.8459 3.8912 3.8446 1.0076 1.0107 1.0080 1.0099 1.0117 1.0119 1.0094 1.0109 1.0077 1.0097 1.0147 1.0237 0.9945 0.9887 1.0031 1.0145 1.0404 1.0041 0.9988 0.9904 0.9962 1.0061 1.0019 1.0077 1.0113 1.0009 0.9881 0.9911 0.9911
dispcorr: -0.034804293 hartree
energy: -1510.101442205580
dipole: -19.29135 18.60437 -0.68698 27.85360 -27.04104 0.81256 15.27358 -13.95500 1.31857
magnitude: 1.69435 au
magnitude: 4.30669 debye
