program: Orca
programVersion: 5.0.2
elementType: Si F O O C C C C C C C C C C C C C C C C C C C C C C C C C H H H H H H H H H H H H H H H H H H H H H H H H H H H H H
charge: 0
multiplicity: 1
keywords: wb97x-d3
keywords: def2-TZVPP
keywords: def2/J RIJCOSX
keywords: DEFGRID2
keywords: scfconv7
keywords: smallprint printgap noloewdin
keywords: NOSOSCF
formula: C25H29FO2Si
InChI: InChI=1/C25H29FO2Si/c1-4-27-21-13-15-23(16-14-21)29(2,3)18-8-9-20-12-17-24(26)25(19-20)28-22-10-6-5-7-11-22/h5-7,10-17,19H,4,8-9,18H2,1-3H3
58 atoms
Si -3.674919 1.767981 0.026689
F  1.924001 -4.612687 -0.034077
O  2.144894 2.044203 1.687299
O  2.090271 -1.970029 0.436956
C  -3.931223 0.367564 -1.239678
C  -2.855343 -0.717038 -1.259487
C  -1.860436 1.870453 0.52597
C  -4.729594 1.481974 1.559488
C  -4.180278 3.398336 -0.77107
C  -2.770187 -1.526453 0.036832
C  -1.425766 1.538022 1.812444
C  -0.877824 2.266611 -0.383354
C  -1.540009 -2.387831 0.068352
C  -0.092101 1.609319 2.177592
C  0.466559 2.341653 -0.042131
C  0.868008 2.016619 1.252326
C  -0.298262 -1.788778 0.267522
C  -1.587688 -3.760732 -0.150135
C  0.8649 -2.535805 0.228819
C  -0.42748 -4.524782 -0.174153
C  0.789214 -3.901912 0.003401
C  3.097908 2.866775 1.022439
C  2.843702 4.343316 1.236495
C  2.618926 -1.152975 -0.52182
C  3.802741 -0.507742 -0.180895
C  2.049513 -0.962895 -1.774967
C  4.414574 0.329581 -1.099116
C  2.672665 -0.112712 -2.680187
C  3.851914 0.53827 -2.352556
H  -4.916022 -0.081879 -1.067651
H  -3.991496 0.822681 -2.23393
H  -1.882913 -0.256231 -1.455543
H  -3.030638 -1.407382 -2.090846
H  -4.512405 0.534012 2.056044
H  -4.604394 2.278391 2.296245
H  -5.787688 1.462155 1.286693
H  -3.560464 3.636675 -1.638562
H  -5.216489 3.365615 -1.116524
H  -4.096197 4.232245 -0.070966
H  -2.749456 -0.850055 0.895974
H  -3.667562 -2.139867 0.148537
H  -2.140577 1.219662 2.562874
H  -1.151783 2.533366 -1.398812
H  0.214338 1.355123 3.185347
H  1.181253 2.654734 -0.792052
H  -0.231148 -0.720904 0.44805
H  -2.54244 -4.248782 -0.30282
H  -0.468763 -5.593517 -0.341708
H  3.153451 2.627064 -0.04244
H  4.056925 2.585195 1.457596
H  3.651085 4.917157 0.779389
H  1.908659 4.677105 0.785461
H  2.819486 4.590205 2.298661
H  4.23924 -0.666066 0.797442
H  1.133936 -1.462883 -2.061945
H  5.336599 0.827504 -0.827486
H  2.223626 0.033542 -3.654247
H  4.329731 1.19779 -3.0648
elementType: Si F O C H
totalener: -1510.06660096 hartree
nucrepener: 2993.61839504 hartree
electener: -4503.68499600 hartree
oneelecener: -8017.70348599 hartree
twoeener: 3514.01848999 hartree
cpcmener: -0.02290040 hartree
kineticenergy: 1503.91346857 hartree
xcener: -135.234090695547 hartree
chargesum: -0.0000000
charge: 0.486671 -0.216509 -0.347038 -0.329080 -0.290404 -0.103660 -0.105191 -0.429581 -0.456114 -0.097515 -0.119568 -0.164886 -0.008313 -0.271627 -0.233106 0.324571 -0.131463 -0.153736 0.147022 -0.194185 0.241152 0.042691 -0.260508 0.319981 -0.239217 -0.193271 -0.145066 -0.170696 -0.181645 0.084852 0.098404 0.070511 0.093518 0.102793 0.108098 0.107865 0.099841 0.101869 0.100650 0.084403 0.094017 0.141256 0.135486 0.130490 0.142419 0.067348 0.140507 0.146771 0.077359 0.113013 0.093960 0.091261 0.091016 0.142272 0.148480 0.158180 0.157651 0.156000
qa: 0.4867 -0.2165 -0.3470 -0.3291 -0.2904 -0.1037 -0.1052 -0.4296 -0.4561 -0.0975 -0.1196 -0.1649 -0.0083 -0.2716 -0.2331 0.3246 -0.1315 -0.1537 0.1470 -0.1942 0.2412 0.0427 -0.2605 0.3200 -0.2392 -0.1933 -0.1451 -0.1707 -0.1816 0.0849 0.0984 0.0705 0.0935 0.1028 0.1081 0.1079 0.0998 0.1019 0.1007 0.0844 0.0940 0.1413 0.1355 0.1305 0.1424 0.0673 0.1405 0.1468 0.0774 0.1130 0.0940 0.0913 0.0910 0.1423 0.1485 0.1582 0.1577 0.1560
va: 4.0692 1.0724 2.0204 2.0819 3.8738 3.8488 3.6837 3.8976 3.9016 3.7619 3.8275 3.8679 3.6759 4.0351 3.8124 3.6630 3.8652 3.8759 3.7256 3.9026 4.0307 3.8524 3.9495 3.6349 3.9025 3.8412 3.8478 3.9081 3.8649 1.0114 1.0072 1.0105 1.0078 1.0104 1.0076 1.0109 1.0119 1.0099 1.0116 1.0225 1.0146 0.9894 0.9940 1.0148 1.0043 1.0437 1.0029 0.9991 0.9916 0.9889 1.0078 1.0019 1.0061 1.0120 1.0035 0.9886 0.9909 0.9907
dispcorr: -0.035105197 hartree
energy: -1510.101706155204
dipole: -20.67492 19.80534 -0.86959 30.26034 -29.12693 1.13341 -3.00912 2.09438 -0.91475
magnitude: 1.69634 au
magnitude: 4.31174 debye
