program: Orca
programVersion: 5.0.2
elementType: Si F O O C C C C C C C C C C C C C C C C C C C C C C C C C H H H H H H H H H H H H H H H H H H H H H H H H H H H H H
charge: 0
multiplicity: 1
keywords: wb97x-d3
keywords: def2-TZVPP
keywords: def2/J RIJCOSX
keywords: DEFGRID2
keywords: scfconv7
keywords: smallprint printgap noloewdin
keywords: NOSOSCF
formula: C25H29FO2Si
InChI: InChI=1/C25H29FO2Si/c1-4-27-21-13-15-23(16-14-21)29(2,3)18-8-9-20-12-17-24(26)25(19-20)28-22-10-6-5-7-11-22/h5-7,10-17,19H,4,8-9,18H2,1-3H3
58 atoms
Si -3.248572 1.456484 0.320635
F  1.67926 -4.456278 0.071005
O  2.552207 2.923235 -0.591444
O  1.914383 -1.79995 -0.371705
C  -3.410769 -0.396409 0.732229
C  -3.876339 -1.321719 -0.392875
C  -1.461567 1.947424 -0.0184
C  -3.842875 2.428176 1.82202
C  -4.310907 1.902991 -1.169811
C  -2.862887 -1.539917 -1.519691
C  -0.629548 2.39668 1.014321
C  -0.88785 1.858102 -1.285764
C  -1.646332 -2.315538 -1.093522
C  0.696072 2.724069 0.799367
C  0.446791 2.166506 -1.526312
C  1.251712 2.599621 -0.47503
C  -0.421765 -1.686499 -0.902981
C  -1.722409 -3.691518 -0.877616
C  0.697566 -2.405336 -0.512025
C  -0.610554 -4.422376 -0.48862
C  0.591939 -3.769181 -0.303846
C  3.216636 2.691848 -1.825432
C  4.672245 3.042379 -1.641956
C  2.147051 -1.021468 0.727002
C  1.311848 -0.990761 1.836648
C  3.30392 -0.250531 0.693316
C  1.645596 -0.178211 2.913006
C  3.622112 0.552954 1.776206
C  2.795976 0.595608 2.892439
H  -2.468858 -0.757043 1.159824
H  -4.135316 -0.461826 1.551729
H  -4.796109 -0.928262 -0.834574
H  -4.144845 -2.298312 0.023419
H  -4.905218 2.245215 2.00076
H  -3.314568 2.143607 2.734628
H  -3.716585 3.504929 1.691641
H  -4.008701 1.380944 -2.079937
H  -5.361474 1.661216 -0.993377
H  -4.256949 2.973894 -1.378484
H  -3.35999 -2.080256 -2.329638
H  -2.555343 -0.579362 -1.94066
H  -1.018236 2.500042 2.021286
H  -1.484786 1.530035 -2.130194
H  1.313704 3.07396 1.61741
H  0.835091 2.064029 -2.530927
H  -0.323751 -0.619992 -1.066626
H  -2.662684 -4.208577 -1.026879
H  -0.674875 -5.491418 -0.330382
H  2.774565 3.30625 -2.617059
H  3.109103 1.643017 -2.122714
H  5.205645 2.876678 -2.578074
H  4.801354 4.089605 -1.366316
H  5.141694 2.42241 -0.877028
H  0.411405 -1.58959 1.880479
H  3.949627 -0.286908 -0.175505
H  0.991359 -0.1559 3.775186
H  4.523596 1.151248 1.74453
H  3.046499 1.226996 3.734549
elementType: Si F O C H
totalener: -1510.06871950 hartree
nucrepener: 3022.07633382 hartree
electener: -4532.14505332 hartree
oneelecener: -8074.82838891 hartree
twoeener: 3542.68333560 hartree
cpcmener: -0.02495255 hartree
kineticenergy: 1503.90643805 hartree
xcener: -135.232899742910 hartree
chargesum: 0.0000000
charge: 0.487120 -0.216715 -0.321854 -0.330421 -0.276920 -0.133008 -0.153833 -0.477885 -0.431151 -0.127649 -0.086104 -0.131043 -0.082775 -0.291676 -0.227202 0.298024 -0.082446 -0.135031 0.108580 -0.220953 0.274514 0.030362 -0.268930 0.326818 -0.189660 -0.239706 -0.177307 -0.125954 -0.189129 0.077564 0.103485 0.083295 0.092371 0.104785 0.100109 0.103014 0.103717 0.109162 0.113774 0.102702 0.084688 0.136057 0.151991 0.135622 0.135815 0.140043 0.143447 0.146276 0.109219 0.098166 0.091252 0.090070 0.083155 0.144358 0.141009 0.155549 0.155804 0.155435
qa: 0.4871 -0.2167 -0.3219 -0.3304 -0.2769 -0.1330 -0.1538 -0.4779 -0.4312 -0.1276 -0.0861 -0.1310 -0.0828 -0.2917 -0.2272 0.2980 -0.0824 -0.1350 0.1086 -0.2210 0.2745 0.0304 -0.2689 0.3268 -0.1897 -0.2397 -0.1773 -0.1260 -0.1891 0.0776 0.1035 0.0833 0.0924 0.1048 0.1001 0.1030 0.1037 0.1092 0.1138 0.1027 0.0847 0.1361 0.1520 0.1356 0.1358 0.1400 0.1434 0.1463 0.1092 0.0982 0.0913 0.0901 0.0832 0.1444 0.1410 0.1555 0.1558 0.1554
va: 4.0744 1.0716 2.0581 2.0844 3.8121 3.8763 3.6938 3.9270 3.8845 3.8216 3.8285 3.8859 3.7159 3.9822 3.8853 3.7532 3.7571 3.8515 3.7537 3.9329 4.0000 3.8062 3.9727 3.6419 3.8174 3.9087 3.8830 3.8470 3.8637 1.0195 1.0019 1.0034 1.0042 1.0110 1.0118 1.0121 1.0098 1.0076 1.0098 1.0066 1.0123 0.9904 0.9833 1.0136 1.0126 1.0031 0.9988 0.9999 0.9888 0.9836 1.0065 1.0030 1.0031 1.0083 1.0078 0.9919 0.9880 0.9906
dispcorr: -0.036021807 hartree
energy: -1510.104741302817
dipole: -17.55802 16.48680 -1.07122 22.77373 -22.46322 0.31051 -2.81217 2.17304 -0.63914
magnitude: 1.28547 au
magnitude: 3.26740 debye
