program: Orca
programVersion: 5.0.2
elementType: Si F O O C C C C C C C C C C C C C C C C C C C C C C C C C H H H H H H H H H H H H H H H H H H H H H H H H H H H H H
charge: 0
multiplicity: 1
keywords: wb97x-d3
keywords: def2-TZVPP
keywords: def2/J RIJCOSX
keywords: DEFGRID2
keywords: scfconv7
keywords: smallprint printgap noloewdin
keywords: NOSOSCF
formula: C25H29FO2Si
InChI: InChI=1/C25H29FO2Si/c1-4-27-21-13-15-23(16-14-21)29(2,3)18-8-9-20-12-17-24(26)25(19-20)28-22-10-6-5-7-11-22/h5-7,10-17,19H,4,8-9,18H2,1-3H3
58 atoms
Si -3.698092 0.066681 0.573579
F  3.065121 -0.070495 0.560431
O  1.077901 1.948456 3.777091
O  2.054353 -1.939559 -1.050503
C  -3.027415 -0.070462 -1.186138
C  -2.624572 1.291136 -1.770285
C  -2.264678 0.672466 1.634343
C  -4.280397 -1.613161 1.190431
C  -5.104689 1.313956 0.640762
C  -1.362739 1.248895 -2.640001
C  -1.172677 -0.161038 1.913138
C  -2.194335 1.975969 2.119476
C  -0.141812 0.91037 -1.83001
C  -0.078903 0.279613 2.633009
C  -1.102013 2.445785 2.842736
C  -0.031447 1.59509 3.100984
C  0.419436 -0.360436 -1.879193
C  0.406729 1.849142 -0.956383
C  1.507119 -0.692168 -1.080882
C  1.487414 1.528532 -0.151012
C  2.027945 0.261243 -0.222185
C  1.185677 3.274037 4.277877
C  2.512597 3.402984 4.983441
C  2.298765 -2.603298 -2.222052
C  2.758712 -1.957735 -3.363334
C  2.115341 -3.978935 -2.211462
C  3.02515 -2.705414 -4.501623
C  2.396112 -4.713934 -3.353994
C  2.845581 -4.08215 -4.505359
H  -2.163832 -0.743193 -1.136655
H  -3.744689 -0.568729 -1.844983
H  -2.452392 2.029626 -0.979359
H  -3.450743 1.690144 -2.363311
H  -3.477042 -2.353255 1.175963
H  -4.652579 -1.558042 2.21568
H  -5.089282 -2.005255 0.569617
H  -5.488977 1.445077 1.654531
H  -4.806363 2.29781 0.273107
H  -5.940749 0.981556 0.020785
H  -1.491579 0.521354 -3.445098
H  -1.226189 2.223945 -3.115189
H  -1.163997 -1.186128 1.557499
H  -3.009055 2.667839 1.93756
H  0.752793 -0.38607 2.83075
H  -1.10761 3.470235 3.190103
H  0.002009 -1.106485 -2.545704
H  -0.016573 2.844454 -0.897377
H  1.910883 2.255807 0.530012
H  0.363732 3.486215 4.970139
H  1.120766 3.995702 3.456248
H  3.347488 3.225744 4.304561
H  2.614037 4.413921 5.378647
H  2.592044 2.708937 5.820814
H  2.914626 -0.886184 -3.372418
H  1.759075 -4.468594 -1.313725
H  3.382351 -2.202087 -5.390911
H  2.253275 -5.786794 -3.342591
H  3.056177 -4.657285 -5.397319
elementType: Si F O C H
totalener: -1510.06951013 hartree
nucrepener: 2918.91775396 hartree
electener: -4428.98726409 hartree
oneelecener: -7868.88530111 hartree
twoeener: 3439.89803702 hartree
cpcmener: -0.02464049 hartree
kineticenergy: 1503.91213164 hartree
xcener: -135.232235660294 hartree
chargesum: 0.0000000
charge: 0.482695 -0.220917 -0.326785 -0.332576 -0.271424 -0.124696 -0.135627 -0.440504 -0.433210 -0.098669 -0.139557 -0.152489 0.089319 -0.279756 -0.234317 0.343679 -0.226108 -0.270107 0.224464 -0.145328 0.177767 0.059508 -0.275073 0.276767 -0.178098 -0.247457 -0.151959 -0.123478 -0.184493 0.080082 0.095492 0.064428 0.092776 0.099747 0.102691 0.102016 0.109934 0.099871 0.108694 0.085052 0.096876 0.132833 0.143710 0.128554 0.134845 0.148533 0.139833 0.144481 0.096983 0.091921 0.087747 0.088830 0.087454 0.154862 0.145638 0.159073 0.157588 0.157887
qa: 0.4827 -0.2209 -0.3268 -0.3326 -0.2714 -0.1247 -0.1356 -0.4405 -0.4332 -0.0987 -0.1396 -0.1525 0.0893 -0.2798 -0.2343 0.3437 -0.2261 -0.2701 0.2245 -0.1453 0.1778 0.0595 -0.2751 0.2768 -0.1781 -0.2475 -0.1520 -0.1235 -0.1845 0.0801 0.0955 0.0644 0.0928 0.0997 0.1027 0.1020 0.1099 0.0999 0.1087 0.0851 0.0969 0.1328 0.1437 0.1286 0.1348 0.1485 0.1398 0.1445 0.0970 0.0919 0.0877 0.0888 0.0875 0.1549 0.1456 0.1591 0.1576 0.1579
va: 4.1421 1.0640 2.0670 2.0703 3.8277 3.8879 3.7030 3.9036 3.9110 3.8609 3.8600 3.8906 3.5783 3.9750 3.8801 3.7157 3.8857 3.8841 3.6468 3.7923 4.0519 3.7966 3.9757 3.7071 3.8884 4.0042 3.8957 3.8888 3.9022 1.0143 1.0122 1.0066 1.0090 1.0115 1.0091 1.0106 1.0076 1.0082 1.0090 1.0083 1.0052 0.9920 0.9884 1.0170 1.0130 1.0054 1.0035 0.9989 0.9874 0.9852 1.0030 1.0057 1.0035 0.9988 1.0084 0.9906 0.9892 0.9905
dispcorr: -0.032008573 hartree
energy: -1510.101518706004
dipole: -24.38022 23.42201 -0.95821 11.49153 -10.30768 1.18385 4.15292 -4.93842 -0.78550
magnitude: 1.71368 au
magnitude: 4.35582 debye
