program: Orca
programVersion: 5.0.2
elementType: Si F O O C C C C C C C C C C C C C C C C C C C C C C C C C H H H H H H H H H H H H H H H H H H H H H H H H H H H H H
charge: 0
multiplicity: 1
keywords: wb97x-d3
keywords: def2-TZVPP
keywords: def2/J RIJCOSX
keywords: DEFGRID2
keywords: scfconv7
keywords: smallprint printgap noloewdin
keywords: NOSOSCF
formula: C25H29FO2Si
InChI: InChI=1/C25H29FO2Si/c1-4-27-21-13-15-23(16-14-21)29(2,3)18-8-9-20-12-17-24(26)25(19-20)28-22-10-6-5-7-11-22/h5-7,10-17,19H,4,8-9,18H2,1-3H3
58 atoms
Si -3.684838 0.029205 0.567327
F  3.105733 -0.045162 0.55513
O  1.073686 1.971901 3.757359
O  2.094434 -1.907712 -1.054042
C  -3.000964 -0.070668 -1.189612
C  -2.602337 1.302655 -1.747932
C  -2.26455 0.651891 1.635738
C  -4.231131 -1.671609 1.158804
C  -5.120449 1.241673 0.646395
C  -1.340315 1.278608 -2.61832
C  -1.157616 -0.165433 1.903231
C  -2.212221 1.953945 2.126791
C  -0.11618 0.938751 -1.813334
C  -0.065668 0.289803 2.616458
C  -1.122558 2.437947 2.844863
C  -0.036151 1.603743 3.090006
C  0.446084 -0.331556 -1.869519
C  0.435391 1.875519 -0.939721
C  1.539961 -0.664074 -1.080069
C  1.520578 1.553311 -0.140797
C  2.06309 0.287618 -0.220143
C  1.170323 3.299408 4.255136
C  2.500289 3.442454 4.95218
C  2.292587 -2.598205 -2.218491
C  2.679802 -1.979047 -3.400711
C  2.140916 -3.976611 -2.158115
C  2.902163 -2.755613 -4.529061
C  2.378342 -4.740283 -3.291478
C  2.752157 -4.135056 -4.483412
H  -2.13249 -0.737332 -1.14243
H  -3.707335 -0.563878 -1.86384
H  -2.431885 2.026373 -0.943217
H  -3.429573 1.710436 -2.333443
H  -4.609305 -1.638752 2.182767
H  -5.027901 -2.073648 0.528704
H  -3.411045 -2.392953 1.138337
H  -4.846131 2.238762 0.296277
H  -5.944848 0.897888 0.01717
H  -5.512445 1.345989 1.660254
H  -1.465461 0.559471 -3.431453
H  -1.209341 2.259667 -3.08249
H  -1.134002 -1.187682 1.540145
H  -3.039975 2.632811 1.954606
H  0.77897 -0.36241 2.803943
H  -1.141368 3.460833 3.196436
H  0.025206 -1.074939 -2.536578
H  0.010465 2.869793 -0.874961
H  1.94596 2.278126 0.541697
H  0.350945 3.504611 4.952533
H  1.092425 4.018716 3.432614
H  3.332333 3.267218 4.269285
H  2.596977 4.45625 5.341206
H  2.58943 2.753599 5.792842
H  2.812121 -0.905556 -3.45024
H  1.843403 -4.445873 -1.228613
H  3.200363 -2.272365 -5.450578
H  2.261097 -5.815114 -3.240484
H  2.92823 -4.73275 -5.36797
elementType: Si F O C H
totalener: -1510.06943501 hartree
nucrepener: 2920.10167216 hartree
electener: -4430.17110717 hartree
oneelecener: -7871.23201170 hartree
twoeener: 3441.06090454 hartree
cpcmener: -0.02457822 hartree
kineticenergy: 1503.91286423 hartree
xcener: -135.232678413542 hartree
chargesum: 0.0000000
charge: 0.483804 -0.220920 -0.326926 -0.331338 -0.270729 -0.126130 -0.134379 -0.439871 -0.432635 -0.098716 -0.139234 -0.154943 0.093937 -0.280592 -0.234024 0.342918 -0.240070 -0.274325 0.239256 -0.140642 0.172495 0.058646 -0.274951 0.289953 -0.188708 -0.253266 -0.149016 -0.120587 -0.187390 0.079634 0.095226 0.065411 0.092516 0.102597 0.101907 0.099790 0.099921 0.108387 0.109658 0.085206 0.096841 0.132515 0.143698 0.128947 0.135098 0.148563 0.139666 0.144042 0.097086 0.092478 0.087690 0.088769 0.087563 0.154876 0.145635 0.159231 0.157520 0.157916
qa: 0.4838 -0.2209 -0.3269 -0.3313 -0.2707 -0.1261 -0.1344 -0.4399 -0.4326 -0.0987 -0.1392 -0.1549 0.0939 -0.2806 -0.2340 0.3429 -0.2401 -0.2743 0.2393 -0.1406 0.1725 0.0586 -0.2750 0.2900 -0.1887 -0.2533 -0.1490 -0.1206 -0.1874 0.0796 0.0952 0.0654 0.0925 0.1026 0.1019 0.0998 0.0999 0.1084 0.1097 0.0852 0.0968 0.1325 0.1437 0.1289 0.1351 0.1486 0.1397 0.1440 0.0971 0.0925 0.0877 0.0888 0.0876 0.1549 0.1456 0.1592 0.1575 0.1579
va: 4.1420 1.0640 2.0661 2.0738 3.8275 3.8900 3.7035 3.9032 3.9115 3.8602 3.8632 3.8944 3.5776 3.9767 3.8799 3.7171 3.8908 3.8855 3.6388 3.7876 4.0522 3.7966 3.9760 3.6992 3.8957 4.0077 3.8932 3.8864 3.9060 1.0141 1.0124 1.0065 1.0090 1.0092 1.0106 1.0115 1.0082 1.0090 1.0077 1.0083 1.0051 0.9922 0.9886 1.0165 1.0127 1.0050 1.0037 0.9995 0.9873 0.9854 1.0030 1.0058 1.0034 0.9987 1.0086 0.9904 0.9892 0.9906
dispcorr: -0.032024452 hartree
energy: -1510.101459458134
dipole: -24.54518 23.55989 -0.98529 11.24435 -10.08139 1.16296 4.11418 -4.89860 -0.78442
magnitude: 1.71423 au
magnitude: 4.35722 debye
