program: Gaussian 09
title: 000062249
version: EM64L-G09RevD.01
frameworkgroup: C1[X(C20H19N3O5S)]
method: RPBEPBE
basis: SDD
operation: Freq
keyword: #p
keyword: freq=noraman
keyword: PBEPBE/SDD
title: #p freq=noraman PBEPBE/SDD
converged: YES YES NO NO
title: Mulliken charges:
elementType: S O O O O O N N N C C C C C C C C C C C C C C C C C C C C H H H H H H H H H H H H H H H H H H H
charge: 0.935587 -0.267848 -0.283613 -0.152656 -0.542723 -0.531362 -0.151741 0.009334 -0.715031 0.487275 0.423388 -0.396384 -0.399484 0.175367 -0.524732 -0.396328 0.112378 -0.434312 -0.371410 0.053915 0.064288 0.254815 -0.657433 -0.657356 0.061020 -0.048271 -0.350118 -0.345371 -0.209020 0.229214 0.231249 0.237492 0.229125 0.270992 0.236489 0.241110 0.282296 0.222280 0.239008 0.222924 0.217406 0.246532 0.225504 0.311553 0.262420 0.284678 0.338438 0.329115
chargesum: 0.00000
title: Mulliken charges with hydrogens summed into heavy atoms:
elementType: S O O O O O N N N C C C C C C C C C C C C C C C C C C C C
charge: 0.935587 -0.267848 -0.283613 -0.152656 -0.542723 -0.531362 -0.151741 0.009334 -0.047478 0.487275 0.423388 0.064079 0.067134 0.175367 -0.253740 -0.159839 0.112378 -0.193201 -0.089114 0.053915 0.064288 0.254815 0.026778 0.032086 0.061020 -0.048271 -0.038565 -0.082951 0.075659
polarizability: 7.46281579e+02 1.66658810e+01 2.68522549e+02 3.57798271e-01 -9.49177592e+00 1.49028731e+02
1716.lowfreq: -9.2459 -2.7764 -0.0009 0.0011 0.0016 3.9203 12.8699 19.9075 33.3171
frequency: 12.8352 19.0693 33.3097 39.1844 43.8466 55.1522 73.5629 84.2684 90.3952 106.1928 115.2719 117.1468 126.3109 152.0230 172.3807 185.6677 211.4267 213.6980 220.5369 241.6107 244.7860 256.2022 264.4515 272.0323 299.8032 305.8911 323.0678 346.4754 359.0132 387.0837 390.0372 415.4589 423.7986 428.1478 446.2532 451.3246 463.0669 476.3640 486.5078 516.6828 536.8195 550.8714 589.1760 612.0218 612.5246 638.0214 658.6435 666.7942 682.9092 724.3133 734.6217 745.8715 758.8465 761.0185 784.7545 788.6049 797.4851 801.5586 802.8181 806.4276 821.3139 825.5708 837.2732 849.7463 876.8638 885.6503 910.9306 912.6901 924.6598 936.2258 955.7089 956.1026 964.6269 980.2243 1016.0349 1031.5493 1072.4999 1074.0018 1075.9433 1094.7362 1114.9714 1127.5853 1148.2344 1168.3244 1173.8562 1195.6544 1199.2111 1230.3380 1249.7018 1266.5103 1280.7538 1291.2613 1294.2707 1338.5541 1346.0940 1356.2085 1379.1785 1390.3189 1393.5921 1396.7793 1418.6654 1424.7564 1442.6182 1463.3833 1468.0780 1469.2490 1478.9860 1483.3987 1493.9914 1501.1017 1512.8850 1534.3497 1534.7455 1544.7596 1587.2517 1609.0353 1613.4369 1636.3132 1701.8588 2987.5224 2988.5304 3000.4754 3005.0057 3048.8958 3054.0638 3085.0679 3085.2894 3094.7550 3096.8599 3134.6263 3155.5437 3162.8502 3177.5209 3178.2025 3185.5788 3190.3772 3362.5274 3530.2657
redmass: 7.0423 4.9166 6.1669 6.2250 4.5779 5.7138 3.6283 3.8162 4.1779 5.6244 3.4502 5.4951 1.8463 4.3079 3.3116 5.1672 1.5371 1.9747 1.4708 5.4531 4.6371 4.1819 5.5339 4.1228 7.6146 3.5295 3.5116 5.4948 6.8189 4.4056 4.7922 5.7529 5.8049 3.4739 3.7154 5.0144 3.6410 4.4323 4.5830 3.8697 3.9216 4.4418 7.3529 5.0276 6.6737 4.1267 7.2493 8.7445 5.2349 7.6753 3.8859 5.3462 4.5481 5.5525 1.2681 1.2466 2.4234 3.0704 1.7008 4.3870 5.7936 1.4633 5.1335 1.7343 3.6603 5.6742 2.5802 1.8476 2.1785 1.3495 2.7478 1.3595 1.4333 7.8207 2.7170 1.9893 1.4867 2.2188 1.8218 1.7081 1.9039 2.1517 2.2670 2.2903 2.9412 2.0309 2.1569 1.9209 1.4849 1.6357 1.2507 1.5140 2.4074 1.2673 1.3838 2.2844 2.9080 1.2137 1.3133 3.1688 3.2953 4.4455 4.4867 2.8188 1.0917 1.0669 1.1115 1.0654 1.1620 2.1357 1.6730 1.0908 4.9837 6.7163 6.5296 8.5685 8.2825 7.4737 12.3739 1.0357 1.0358 1.0605 1.0611 1.1029 1.1024 1.0998 1.0998 1.1014 1.1010 1.0898 1.0919 1.0894 1.0937 1.0934 1.0971 1.0910 1.0414 1.1000
irintensity: 0.8076 0.6915 1.7871 0.3139 0.1964 1.0224 0.1892 0.0648 3.2043 0.2144 7.5625 2.7304 29.7344 0.5434 2.3705 0.4876 1.7864 4.6887 0.2401 7.7802 0.7154 6.9500 1.0905 12.4394 4.6097 2.5197 0.1858 2.1055 4.0638 5.5170 0.7337 52.6832 70.2860 6.8274 1.5035 2.8410 9.1409 161.4474 24.7376 40.7811 16.0415 10.6974 4.7787 19.9249 12.7777 5.7682 7.6253 0.2352 13.6782 24.1698 2.4678 11.3203 9.1613 66.4759 22.3583 0.7711 31.6946 208.4464 98.0550 63.1481 21.1815 42.1632 11.5348 39.9201 5.1126 4.9784 49.1347 32.2949 3.9825 7.1765 1.6911 0.4243 11.1814 30.2646 44.3323 46.3073 24.1893 12.6237 55.8193 17.3071 38.5289 92.6259 59.6572 31.1193 34.7889 68.3668 29.8497 24.0276 8.6378 142.9029 39.3322 54.5412 77.1318 11.0871 244.7071 15.9742 8.7975 6.1013 32.1308 53.4366 203.6076 7.9992 1.0266 73.4118 13.7313 2.9944 5.9787 6.3373 40.7959 57.7198 12.0251 23.7044 9.0282 809.9709 82.2296 444.6209 128.6877 1058.7169 285.2467 31.4011 29.2621 44.1862 76.8240 3.7440 7.5096 24.1887 57.5611 21.7491 75.3964 4.5278 1.0840 9.3774 13.0082 17.7998 3.5134 6.3947 31.1792 23.5783
temp: 298.150 k
press: 1.00000 atm
elementType: 16 8 8 8 8 8 7 7 7 6 6 6 6 6 6 6 6 6 6 6 6 6 6 6 6 6 6 6 6 1 1 1 1 1 1 1 1 1 1 1 1 1 1 1 1 1 1 1
symmnumber: 1
zpe: 937340.0 jmol-1
zpe.correction: 0.357014 hartree
zpe.thermalcorrener: 0.384569 hartree
zpe.thermalcorrenthalpy: 0.385514 hartree
zpe.thermalcorrgfe: 0.296692 hartree
zpe.sumelectzpe: -1709.706933 hartree
zpe.sumelectthermal: -1709.679377 hartree
zpe.sumelectthermalent: -1709.678433 hartree
zpe.sumelectthermalfe: -1709.767254 hartree
dipole: -12.9357 -5.8292 3.7642
dipole: 14.6792
quadrupole: -126.3437 -179.7616 -181.4935
quadrupole: 3.4979 26.6597 3.0677
quadrupole: 36.1892 -17.2286 -18.9606 3.4979 26.6597 3.0677
hfenergy: -1710.0639465 hartree
pointgroup: C01 [X(C20H19N3O5S1)]
dipole: 5.1076588 -2.2966117 -1.4110172 debye
polarizability: 746.4955412|-13.1920093|268.74067|1.4433982|6.1536399|148.5966481 unknown
InChI: InChI=1S/C20H19N3O5S/c1-3-23(4-2)13-6-5-12-9-15(20(24)28-18(12)10-13)19-22-16-11-14(29(21,25)26)7-8-17(16)27-19/h5-11H,3-4,21H2,1-2H3
charge 0 multiplicity 1
48 atoms
S  -7.610259 0.104373 0.073363
O  2.148342 1.783968 0.127983
O  -1.776704 -1.201368 -0.148353
O  0.092312 2.804392 0.230177
O  -8.438147 -1.196272 0.598762
O  -7.719013 1.572458 0.769796
N  6.61594 -0.064746 -0.078326
N  -2.319393 1.055419 0.105474
N  -8.081423 0.267094 -1.701454
C  5.239238 -0.244148 -0.092737
C  2.380483 -0.642503 -0.11584
C  7.558138 -1.183792 -0.30941
C  7.223431 1.265953 0.157405
C  2.963885 0.659203 0.014915
C  4.346626 0.868595 0.023443
C  4.661243 -1.565035 -0.223235
C  0.119805 0.3585 0.000728
C  3.280698 -1.745739 -0.235891
C  0.962214 -0.755009 -0.116794
C  -1.320957 0.186502 -0.001612
C  -3.50396 0.287166 0.034116
C  -3.174454 -1.093974 -0.121659
C  7.918856 -1.960313 0.977733
C  7.374759 2.109398 -1.129238
C  0.675381 1.71726 0.126816
C  -5.78915 -0.353027 -0.014815
C  -4.853962 0.687897 0.093678
C  -4.12222 -2.120719 -0.213811
C  -5.478393 -1.723687 -0.159497
H  7.141377 -1.867539 -1.070667
H  8.476473 -0.756106 -0.752335
H  6.627783 1.812738 0.910375
H  8.217855 1.100523 0.611536
H  4.702155 1.897249 0.102937
H  5.307857 -2.442113 -0.29779
H  2.867757 -2.756751 -0.331167
H  0.505639 -1.745601 -0.212159
H  8.384006 -1.292101 1.724476
H  7.022856 -2.410189 1.439306
H  8.636055 -2.769893 0.749305
H  8.012024 1.591924 -1.86883
H  6.395744 2.302287 -1.600375
H  7.843121 3.082682 -0.895063
H  -5.152185 1.729513 0.239417
H  -3.838229 -3.1701 -0.320353
H  -6.285589 -2.460985 -0.203983
H  -8.960142 -0.26192 -1.833717
H  -8.174271 1.271234 -1.92923
