program: Gaussian 09
title: 000062247
version: EM64L-G09RevD.01
frameworkgroup: C1[X(C15H30O10)]
method: RPBEPBE
basis: SDD
operation: Freq
keyword: #p
keyword: freq=noraman
keyword: PBEPBE/SDD
title: #p freq=noraman PBEPBE/SDD
converged: YES YES NO NO
title: Mulliken charges:
elementType: O O O O O O O O O O C C C C C C C C C C C C C C C H H H H H H H H H H H H H H H H H H H H H H H H H H H H H H
charge: -0.265695 -0.341949 -0.288756 -0.291748 -0.256400 -0.316962 -0.450556 -0.472195 -0.462428 -0.444639 -0.122490 -0.083801 0.014211 -0.080177 -0.048385 -0.341636 -0.256587 -0.250148 -0.233044 -0.504459 -0.333759 -0.297972 -0.230973 -0.330012 -0.322429 0.273633 0.236737 0.244848 0.236734 0.208744 0.234223 0.214612 0.266616 0.196248 0.206715 0.211369 0.192050 0.217918 0.237810 0.201102 0.228175 0.205962 0.196488 0.216495 0.189725 0.207202 0.187733 0.185730 0.213675 0.197677 0.207912 0.344459 0.353657 0.348322 0.350421
chargesum: 0.00000
title: Mulliken charges with hydrogens summed into heavy atoms:
elementType: O O O O O O O O O O C C C C C C C C C C C C C C C
charge: -0.265695 -0.341949 -0.288756 -0.291748 -0.256400 -0.316962 -0.106097 -0.118538 -0.114106 -0.094218 0.151142 0.152936 0.259059 0.156557 0.160359 0.107199 0.206277 0.167936 0.176924 0.162628 0.068691 0.108248 0.163961 0.069392 0.083159
polarizability: 2.29730780e+02 1.01782541e+00 1.89722639e+02 7.88089012e+00 1.29084131e+00 1.83843572e+02
1716.lowfreq: -6.3097 -5.9868 -0.0004 0.0002 0.0006 5.5941 18.1276 23.3218 27.3870
frequency: 17.8567 23.2421 27.2548 30.0606 34.9497 39.6963 43.1385 49.1938 54.3461 65.7119 71.6321 74.8934 87.3859 98.2920 122.5513 133.9786 134.7774 143.7565 153.9520 162.0220 177.0838 184.1837 206.6723 212.2137 226.3440 232.6384 240.4183 245.8895 258.9441 287.7093 300.1710 309.8153 328.3480 332.3844 364.1270 390.0106 422.3105 456.2860 463.1387 465.5159 471.2558 479.1340 515.9617 540.6275 546.7128 563.5721 601.6304 630.7552 721.4609 806.0971 819.3858 825.6628 845.4910 848.5014 857.2817 862.1053 870.0153 871.9520 905.3045 921.9695 937.2544 947.6536 973.8501 982.0011 993.3138 1006.5158 1021.4160 1023.4704 1031.6884 1042.8016 1045.1017 1049.8072 1057.2421 1064.5094 1070.0034 1072.8703 1079.1301 1088.1361 1091.2251 1095.7729 1106.2852 1112.5280 1141.1658 1143.5307 1165.7106 1184.5349 1188.8852 1189.6588 1197.2748 1203.8130 1206.3869 1208.7588 1212.4738 1222.5863 1237.5857 1257.5694 1264.9388 1271.7381 1279.1775 1288.5274 1305.2462 1314.1911 1322.3886 1325.9755 1327.4550 1340.2868 1346.9375 1357.3120 1364.0362 1375.8550 1381.3358 1384.2101 1388.3012 1391.1608 1398.6496 1403.3926 1416.0251 1433.3972 1452.9443 1454.6387 1457.4682 1460.0694 1461.4890 1461.6312 1462.7106 1466.0640 1471.8536 1477.0782 1478.1595 2925.7425 2937.1531 2939.3535 2947.3906 2954.5879 2955.0348 2960.7582 2962.9502 2966.3304 2969.3022 2970.7431 2971.3858 2992.7573 2999.8903 3002.3975 3004.4871 3014.2501 3015.9521 3019.5168 3035.3449 3037.2831 3057.0237 3063.7346 3077.1892 3079.2612 3116.9148 3534.2855 3539.2106 3575.4216 3576.3744
redmass: 5.6195 5.6540 5.2354 4.0055 4.1179 4.5159 3.3694 3.9439 3.7737 4.0262 4.4091 3.7159 3.3479 4.4986 4.0868 2.2000 2.9001 4.0400 2.3382 2.7288 3.3911 3.2924 1.6466 2.6753 2.9801 1.7413 1.3695 2.9280 3.3146 5.4035 3.5453 3.0923 4.0487 2.9927 3.4640 3.8905 3.0726 3.0483 1.2233 1.1622 2.5748 3.8821 3.3088 3.3070 3.0198 3.6595 3.3007 4.3547 3.9489 2.8996 2.8892 2.6815 2.9256 3.0654 2.3854 2.7062 2.8377 2.7664 3.3748 3.5644 5.3875 2.2267 2.8898 2.6775 3.3723 3.3115 3.7305 3.7280 2.9390 2.5258 2.7714 2.4759 2.7329 2.1184 4.2848 3.7912 2.0850 2.0171 3.0792 1.8164 2.1516 1.2774 2.4454 2.0885 1.6798 1.1863 1.1452 1.1670 1.3062 1.2338 1.2542 1.2196 1.1172 1.1216 1.4546 1.2254 1.1369 1.1360 1.3118 1.1366 1.2754 1.2045 1.2087 1.2203 1.2077 1.3207 1.2883 1.5585 1.3396 1.3201 1.2421 1.2502 1.3933 1.4106 1.5513 1.4990 1.5716 1.1989 1.0810 1.0521 1.0870 1.0823 1.0809 1.0875 1.0862 1.0841 1.0905 1.0742 1.0555 1.0832 1.0551 1.0566 1.0571 1.0422 1.0527 1.0674 1.0712 1.0591 1.0590 1.0772 1.0663 1.0841 1.1030 1.1016 1.0884 1.1027 1.0891 1.1007 1.1054 1.1051 1.0969 1.1005 1.0964 1.0960 1.1020 1.0651 1.0652 1.0665 1.0665
irintensity: 0.0067 0.0694 0.8687 0.1224 2.5670 3.3034 2.2215 0.1005 0.8086 2.4600 0.1095 7.3392 4.1153 1.4823 6.2921 2.0301 9.3696 7.5065 6.4171 11.4975 21.8353 5.5223 96.1659 14.3708 4.6432 14.1743 150.5676 23.9075 10.4026 9.8130 2.1361 15.6472 2.0648 2.1216 3.2148 14.6499 7.5755 21.3353 111.3192 165.4802 18.2356 30.4586 6.7044 16.2532 2.5778 8.8364 2.2074 14.5059 12.4009 4.2413 33.6880 4.6831 5.7467 8.1148 18.7369 24.5617 20.2255 24.2263 61.5887 55.3916 41.8076 25.0701 139.8083 28.9663 18.6536 41.9496 165.2784 76.7418 41.4434 86.1208 48.8847 29.2242 31.6612 64.7383 193.4011 96.4129 99.6585 6.4398 37.8522 36.3482 21.0705 2.2094 63.4437 9.0083 11.4580 5.1508 7.6649 3.7998 3.8382 10.6856 11.9169 18.8762 14.5827 21.3513 2.8717 2.4682 13.8627 25.6778 14.4846 5.1665 0.5097 25.0988 24.3251 23.2667 13.1164 9.1502 5.7140 7.8963 6.7366 4.7556 18.6731 31.7750 11.5437 3.9307 1.1804 1.5196 1.2981 8.5056 17.0240 9.5014 11.2157 4.0497 15.5807 3.9397 3.3178 5.7682 15.4132 4.9850 17.4430 37.6123 57.1178 13.5265 49.1477 93.5676 90.6318 24.2314 32.0761 48.0594 56.5733 6.7886 96.9103 39.7174 88.0055 22.5558 31.8277 40.9567 23.6019 63.2438 44.7252 33.2907 44.5590 15.9514 41.0118 41.8442 28.1379 7.7038 7.7580 4.6910 5.1411
temp: 298.150 k
press: 1.00000 atm
elementType: 8 8 8 8 8 8 8 8 8 8 6 6 6 6 6 6 6 6 6 6 6 6 6 6 6 1 1 1 1 1 1 1 1 1 1 1 1 1 1 1 1 1 1 1 1 1 1 1 1 1 1 1 1 1 1
symmnumber: 1
zpe: 1195170.8 jmol-1
zpe.correction: 0.455217 hartree
zpe.thermalcorrener: 0.485771 hartree
zpe.thermalcorrenthalpy: 0.486716 hartree
zpe.thermalcorrgfe: 0.388991 hartree
zpe.sumelectzpe: -1339.622920 hartree
zpe.sumelectthermal: -1339.592365 hartree
zpe.sumelectthermalent: -1339.591421 hartree
zpe.sumelectthermalfe: -1339.689145 hartree
dipole: 4.3003 -5.6623 -2.2341
dipole: 7.4528
quadrupole: -135.3459 -164.9129 -132.5836
quadrupole: 16.7583 3.6425 12.5789
quadrupole: 8.9349 -20.6321 11.6972 16.7583 3.6425 12.5789
hfenergy: -1340.0781366 hartree
pointgroup: C01 [X(C15H30O10)]
dipole: 1.5706699 -2.4111856 -0.562887 debye
polarizability: 230.9897001|1.732169|189.8752432|1.0066487|-0.5754635|182.4320486 unknown
InChI: InChI=1S/C15H30O10/c1-20-15-14(24-9-5-19)13(23-8-4-18)12(22-7-3-17)11(25-15)10-21-6-2-16/h11-19H,2-10H2,1H3
charge 0 multiplicity 1
55 atoms
O  -0.408822 -0.76874 1.898705
O  0.497608 1.656899 -0.469613
O  -1.158722 -1.658464 -0.807748
O  2.802571 0.006704 0.144133
O  1.80411 -1.136878 2.576873
O  -3.709394 0.164854 0.588282
O  -0.143699 4.271969 -1.308126
O  1.026404 -2.302731 -2.785015
O  4.751713 1.030859 -1.83829
O  -5.856961 2.018331 0.558532
C  0.486971 0.201249 -0.696032
C  -0.979558 -0.240981 -0.463956
C  1.442225 -0.522628 0.283303
C  -1.348045 -0.04803 1.0199
C  0.998923 -0.312705 1.737782
C  -2.729662 -0.596594 1.376729
C  1.479442 2.403845 -1.296061
C  -1.308537 -1.933758 -2.242406
C  3.66587 -0.812522 -0.711429
C  1.592432 -0.89704 4.011668
C  1.230971 3.875159 -0.975095
C  -0.285158 -2.970067 -2.695438
C  -5.086999 -0.315554 0.781191
C  4.982078 -0.071347 -0.887255
C  -5.978673 0.662809 0.016552
H  0.79502 -0.02959 -1.735084
H  -1.648655 0.397014 -1.07675
H  1.400189 -1.610154 0.072035
H  -1.304659 1.042454 1.227383
H  1.057466 0.763512 2.024441
H  -2.777056 -1.672884 1.121213
H  -2.917326 -0.462321 2.461982
H  2.508675 2.085342 -1.052425
H  1.273895 2.199283 -2.368063
H  -2.328194 -2.33722 -2.407332
H  -1.193069 -1.011849 -2.846749
H  3.850462 -1.794673 -0.224606
H  3.196614 -0.983575 -1.702725
H  0.567086 -1.179561 4.309942
H  1.772539 0.168534 4.26418
H  2.327653 -1.530181 4.531481
H  1.888623 4.515468 -1.587082
H  1.443769 4.060449 0.099015
H  -0.262851 -3.801024 -1.961263
H  -0.588548 -3.367241 -3.688484
H  -5.340297 -0.305067 1.863159
H  -5.194121 -1.35197 0.392667
H  5.745462 -0.774631 -1.284736
H  5.314595 0.306571 0.101156
H  -5.710126 0.639845 -1.060985
H  -7.040227 0.384784 0.12796
H  -0.73084 3.56197 -0.937838
H  1.724489 -2.970153 -2.999924
H  5.536027 1.634438 -1.842263
H  -4.884782 2.207092 0.629007
