program: Orca
programVersion: 5.0.2
elementType: Si F O O C C C C C C C C C C C C C C C C C C C C C C C C C H H H H H H H H H H H H H H H H H H H H H H H H H H H H H
charge: 0
multiplicity: 1
keywords: wb97x-d3
keywords: def2-TZVPP
keywords: def2/J RIJCOSX
keywords: DEFGRID2
keywords: scfconv7
keywords: smallprint printgap noloewdin
keywords: NOSOSCF
formula: C25H29FO2Si
InChI: InChI=1/C25H29FO2Si/c1-4-27-21-13-15-23(16-14-21)29(2,3)18-8-9-20-12-17-24(26)25(19-20)28-22-10-6-5-7-11-22/h5-7,10-17,19H,4,8-9,18H2,1-3H3
58 atoms
Si -3.533328 1.783055 0.553346
F  1.481509 -5.404347 0.308314
O  2.14618 3.799992 -0.033401
O  2.215105 -2.917915 -0.350319
C  -3.664324 0.321061 -0.639718
C  -2.656904 -0.778674 -0.308593
C  -1.785434 2.460339 0.368848
C  -3.795349 1.213619 2.328098
C  -4.804573 3.098368 0.108404
C  -2.440439 -1.786847 -1.441334
C  -0.948317 2.707372 1.460951
C  -1.243301 2.686619 -0.896748
C  -1.395738 -2.797514 -1.060479
C  0.353037 3.151399 1.301132
C  0.060989 3.125801 -1.084193
C  0.873646 3.361921 0.023122
C  -0.066293 -2.396713 -0.94775
C  -1.726482 -4.108464 -0.7353
C  0.903678 -3.265978 -0.47646
C  -0.758114 -4.999628 -0.29194
C  0.541878 -4.566073 -0.150678
C  2.766341 4.0381 -1.291836
C  3.283375 2.773956 -1.943272
C  2.550917 -1.735888 0.254055
C  1.778386 -1.146207 1.24787
C  3.75056 -1.159438 -0.142357
C  2.210689 0.038753 1.827553
C  4.175168 0.01673 0.457703
C  3.404022 0.62961 1.436149
H  -4.682904 -0.080577 -0.644027
H  -3.49089 0.695132 -1.655806
H  -2.975999 -1.313782 0.590704
H  -1.686305 -0.335565 -0.061688
H  -3.036854 0.496633 2.648405
H  -3.777977 2.046555 3.034225
H  -4.76708 0.725726 2.435723
H  -4.663128 3.46895 -0.909238
H  -5.822635 2.707087 0.173111
H  -4.742467 3.958263 0.778971
H  -3.380509 -2.289305 -1.681898
H  -2.131354 -1.247411 -2.34145
H  -1.309366 2.547032 2.470731
H  -1.841196 2.507562 -1.784388
H  0.9787 3.33645 2.166321
H  0.419791 3.271329 -2.094182
H  0.213145 -1.382396 -1.211432
H  -2.752699 -4.44318 -0.821385
H  -1.014952 -6.020056 -0.037594
H  3.599144 4.706685 -1.071814
H  2.093126 4.584502 -1.959134
H  3.760574 3.027623 -2.891158
H  4.03037 2.287671 -1.316573
H  2.493876 2.052003 -2.154565
H  0.850095 -1.595377 1.576839
H  4.347227 -1.631447 -0.913036
H  1.604889 0.496711 2.598609
H  5.11247 0.460304 0.147245
H  3.732427 1.553502 1.893473
elementType: Si F O C H
totalener: -1510.06835146 hartree
nucrepener: 2915.39060233 hartree
electener: -4425.45895379 hartree
oneelecener: -7861.03981893 hartree
twoeener: 3435.58086515 hartree
cpcmener: -0.02449000 hartree
kineticenergy: 1503.91002717 hartree
xcener: -135.231032776332 hartree
chargesum: 0.0000000
charge: 0.481253 -0.217486 -0.335152 -0.331158 -0.285454 -0.117467 -0.176503 -0.444685 -0.417437 -0.055309 -0.064257 -0.153157 0.018216 -0.341723 -0.242477 0.366376 -0.226089 -0.200060 0.204625 -0.164522 0.182371 0.046640 -0.273391 0.314439 -0.198758 -0.248152 -0.136327 -0.133037 -0.210117 0.092165 0.078738 0.094133 0.063298 0.106868 0.107281 0.111511 0.099969 0.101389 0.100738 0.081063 0.088420 0.139214 0.132840 0.136336 0.139819 0.145026 0.140284 0.147225 0.107846 0.088831 0.102418 0.084642 0.092868 0.154151 0.144807 0.157442 0.163094 0.156383
qa: 0.4813 -0.2175 -0.3352 -0.3312 -0.2855 -0.1175 -0.1765 -0.4447 -0.4174 -0.0553 -0.0643 -0.1532 0.0182 -0.3417 -0.2425 0.3664 -0.2261 -0.2001 0.2046 -0.1645 0.1824 0.0466 -0.2734 0.3144 -0.1988 -0.2482 -0.1363 -0.1330 -0.2101 0.0922 0.0787 0.0941 0.0633 0.1069 0.1073 0.1115 0.1000 0.1014 0.1007 0.0811 0.0884 0.1392 0.1328 0.1363 0.1398 0.1450 0.1403 0.1472 0.1078 0.0888 0.1024 0.0846 0.0929 0.1542 0.1448 0.1574 0.1631 0.1564
va: 4.1313 1.0688 2.0602 2.0842 3.8611 3.8471 3.7521 3.9123 3.8982 3.8006 3.7958 3.8835 3.6653 4.0210 3.8989 3.6683 3.9208 3.9094 3.6893 3.8730 4.0664 3.8539 3.9060 3.6856 3.8887 3.9953 3.8539 3.8578 3.8558 1.0169 1.0173 1.0059 1.0047 1.0047 1.0084 1.0077 1.0094 1.0093 1.0092 1.0139 1.0086 0.9886 0.9943 1.0126 1.0051 1.0038 1.0034 0.9985 0.9918 0.9970 1.0119 1.0096 1.0024 0.9992 1.0086 0.9915 0.9839 0.9976
dispcorr: -0.032030897 hartree
energy: -1510.100382354191
dipole: -18.53317 17.65081 -0.88236 28.18812 -27.13267 1.05546 -3.49357 2.65874 -0.83484
magnitude: 1.60920 au
magnitude: 4.09025 debye
