program: Orca
programVersion: 5.0.2
elementType: Si F O O C C C C C C C C C C C C C C C C C C C C C C C C C H H H H H H H H H H H H H H H H H H H H H H H H H H H H H
charge: 0
multiplicity: 1
keywords: wb97x-d3
keywords: def2-TZVPP
keywords: def2/J RIJCOSX
keywords: DEFGRID2
keywords: scfconv7
keywords: smallprint printgap noloewdin
keywords: NOSOSCF
formula: C25H29FO2Si
InChI: InChI=1/C25H29FO2Si/c1-4-27-21-13-15-23(16-14-21)29(2,3)18-8-9-20-12-17-24(26)25(19-20)28-22-10-6-5-7-11-22/h5-7,10-17,19H,4,8-9,18H2,1-3H3
58 atoms
Si -3.354542 0.893462 1.427845
F  2.056691 -1.831768 -2.588025
O  1.939556 3.270752 -0.299147
O  1.410464 -3.13616 -0.267586
C  -3.303759 -0.90713 0.839652
C  -3.867311 -1.162821 -0.561127
C  -1.734156 1.702639 0.90136
C  -3.484943 0.954964 3.304739
C  -4.826624 1.795905 0.673459
C  -3.355411 -2.460904 -1.202066
C  -1.036912 2.578504 1.730767
C  -1.142224 1.405331 -0.333779
C  -1.90767 -2.351021 -1.59185
C  0.188276 3.132208 1.371836
C  0.072787 1.941977 -0.714515
C  0.754498 2.81006 0.141579
C  -0.894339 -2.809458 -0.75377
C  -1.549035 -1.70332 -2.772152
C  0.440058 -2.63037 -1.082654
C  -0.217586 -1.519916 -3.11612
C  0.763855 -1.988929 -2.269909
C  2.707645 4.125297 0.537386
C  3.999968 4.432288 -0.177309
C  2.347066 -2.286226 0.259053
C  3.566458 -2.850911 0.609615
C  2.104687 -0.935357 0.469758
C  4.55659 -2.049657 1.156802
C  3.110566 -0.14491 1.009687
C  4.338633 -0.691908 1.351903
H  -2.254791 -1.217643 0.895401
H  -3.828713 -1.542745 1.560358
H  -3.640485 -0.337538 -1.243319
H  -4.958254 -1.201374 -0.50606
H  -2.652294 0.443495 3.792264
H  -3.510054 1.978345 3.684657
H  -4.404329 0.468973 3.640154
H  -4.867809 2.833618 1.012177
H  -4.78389 1.81423 -0.41747
H  -5.771097 1.324758 0.956322
H  -3.501091 -3.295817 -0.512009
H  -3.952573 -2.678935 -2.090954
H  -1.439841 2.844296 2.701825
H  -1.628533 0.725132 -1.024221
H  0.682562 3.801019 2.063875
H  0.510668 1.682977 -1.671486
H  -1.137072 -3.319905 0.170899
H  -2.319114 -1.334968 -3.439136
H  0.057822 -1.024665 -4.038696
H  2.910242 3.637206 1.496853
H  2.155828 5.048179 0.746155
H  4.574037 3.52546 -0.371542
H  3.824417 4.941979 -1.125231
H  4.610905 5.086766 0.444545
H  3.738351 -3.90759 0.446258
H  1.149015 -0.49001 0.221137
H  5.508674 -2.491235 1.421892
H  2.925172 0.910321 1.164494
H  5.118004 -0.067186 1.767763
elementType: Si F O C H
totalener: -1510.06838797 hartree
nucrepener: 2958.31765552 hartree
electener: -4468.38604349 hartree
oneelecener: -7947.11743970 hartree
twoeener: 3478.73139622 hartree
cpcmener: -0.02359595 hartree
kineticenergy: 1503.90078930 hartree
xcener: -135.227903182020 hartree
chargesum: 0.0000000
charge: 0.496868 -0.216866 -0.322936 -0.330179 -0.285873 -0.154113 -0.206585 -0.456626 -0.414144 -0.079907 -0.118534 -0.033525 0.066863 -0.247414 -0.344928 0.332123 -0.266432 -0.223708 0.200564 -0.171358 0.241163 0.041902 -0.267398 0.249143 -0.229051 -0.137574 -0.121857 -0.148216 -0.201779 0.088677 0.096363 0.079532 0.092425 0.107810 0.098332 0.105193 0.106960 0.101226 0.105185 0.085235 0.096621 0.137170 0.149721 0.137152 0.130125 0.139841 0.140225 0.148179 0.092927 0.105817 0.086367 0.087474 0.088978 0.143230 0.127801 0.156265 0.161713 0.153832
qa: 0.4969 -0.2169 -0.3229 -0.3302 -0.2859 -0.1541 -0.2066 -0.4566 -0.4141 -0.0799 -0.1185 -0.0335 0.0669 -0.2474 -0.3449 0.3321 -0.2664 -0.2237 0.2006 -0.1714 0.2412 0.0419 -0.2674 0.2491 -0.2291 -0.1376 -0.1219 -0.1482 -0.2018 0.0887 0.0964 0.0795 0.0924 0.1078 0.0983 0.1052 0.1070 0.1012 0.1052 0.0852 0.0966 0.1372 0.1497 0.1372 0.1301 0.1398 0.1402 0.1482 0.0929 0.1058 0.0864 0.0875 0.0890 0.1432 0.1278 0.1563 0.1617 0.1538
va: 4.0993 1.0665 2.0594 2.0741 3.8098 3.9155 3.8053 3.9166 3.8728 3.8324 3.8767 3.7129 3.5599 3.8957 4.0164 3.7152 3.9732 3.8760 3.7080 3.8731 3.9674 3.8005 3.9702 3.7319 3.9847 3.8464 3.9007 3.8945 3.9340 1.0106 1.0094 0.9948 1.0076 1.0082 1.0114 1.0120 1.0111 1.0094 1.0066 1.0100 1.0055 0.9900 0.9627 1.0122 1.0203 1.0130 1.0037 0.9986 0.9834 0.9894 1.0039 1.0036 1.0060 1.0097 1.0276 0.9886 0.9790 0.9933
dispcorr: -0.033050149 hartree
energy: -1510.101438117337
dipole: -17.57134 16.83757 -0.73377 19.23754 -18.32731 0.91024 13.90106 -13.31291 0.58815
magnitude: 1.30876 au
magnitude: 3.32662 debye
