program: Orca
programVersion: 5.0.2
elementType: Si F O O C C C C C C C C C C C C C C C C C C C C C C C C C H H H H H H H H H H H H H H H H H H H H H H H H H H H H H
charge: 0
multiplicity: 1
keywords: wb97x-d3
keywords: def2-TZVPP
keywords: def2/J RIJCOSX
keywords: DEFGRID2
keywords: scfconv7
keywords: smallprint printgap noloewdin
keywords: NOSOSCF
formula: C25H29FO2Si
InChI: InChI=1/C25H29FO2Si/c1-4-27-21-13-15-23(16-14-21)29(2,3)18-8-9-20-12-17-24(26)25(19-20)28-22-10-6-5-7-11-22/h5-7,10-17,19H,4,8-9,18H2,1-3H3
58 atoms
Si -3.356542 1.406705 -0.015138
F  1.426597 -3.059073 1.940686
O  2.20243 1.619877 2.386882
O  2.028876 -1.870982 -0.328787
C  -3.699896 -0.3743 -0.537825
C  -2.987785 -0.805879 -1.82498
C  -1.599464 1.49243 0.667309
C  -4.567557 1.897021 1.343146
C  -3.525051 2.584517 -1.473243
C  -2.631644 -2.299368 -1.860434
C  -0.761029 2.583587 0.439141
C  -1.089149 0.473865 1.482943
C  -1.550066 -2.613967 -0.864324
C  0.51518 2.675193 0.985616
C  0.176327 0.540477 2.03523
C  0.994434 1.645873 1.792468
C  -0.253968 -2.167042 -1.120283
C  -1.813363 -3.24726 0.343592
C  0.746214 -2.288994 -0.171162
C  -0.807968 -3.415861 1.289858
C  0.450703 -2.926881 1.029529
C  3.153583 2.648211 2.14188
C  3.866757 2.483977 0.817667
C  2.36571 -0.830671 -1.151266
C  1.548991 0.271194 -1.375558
C  3.62941 -0.899523 -1.724315
C  2.000311 1.289263 -2.203748
C  4.073789 0.135731 -2.532758
C  3.258345 1.230332 -2.786488
H  -3.398691 -1.011537 0.301236
H  -4.778362 -0.532185 -0.637318
H  -2.063385 -0.237574 -1.977888
H  -3.61945 -0.566735 -2.683881
H  -5.601358 1.863067 0.991207
H  -4.494164 1.22768 2.20349
H  -4.378587 2.910243 1.70462
H  -2.795396 2.379934 -2.259322
H  -4.517547 2.500882 -1.922272
H  -3.399101 3.627056 -1.173086
H  -3.522518 -2.898301 -1.655735
H  -2.295304 -2.56429 -2.866348
H  -1.096296 3.403576 -0.186623
H  -1.689302 -0.402899 1.701707
H  1.114456 3.548102 0.762994
H  0.544821 -0.264738 2.659779
H  -0.039592 -1.69646 -2.071937
H  -2.810638 -3.608611 0.56066
H  -1.007668 -3.910399 2.232151
H  3.868084 2.565175 2.96129
H  2.691343 3.636559 2.225089
H  4.659881 3.229501 0.742193
H  4.328522 1.49878 0.740632
H  3.20477 2.621072 -0.036536
H  0.572236 0.35098 -0.916928
H  4.260812 -1.758026 -1.531704
H  1.357753 2.142235 -2.381451
H  5.060935 0.078102 -2.973019
H  3.601964 2.032004 -3.426847
elementType: Si F O C H
totalener: -1510.06625036 hartree
nucrepener: 3067.51094622 hartree
electener: -4577.57719657 hartree
oneelecener: -8165.74420669 hartree
twoeener: 3588.16701012 hartree
cpcmener: -0.02273078 hartree
kineticenergy: 1503.89952235 hartree
xcener: -135.237222285429 hartree
chargesum: -0.0000000
charge: 0.454691 -0.220363 -0.331239 -0.322321 -0.275627 -0.126117 -0.136550 -0.415454 -0.439106 -0.091367 -0.132311 -0.135114 0.068346 -0.272300 -0.253205 0.346857 -0.256315 -0.269060 0.276151 -0.106443 0.118463 0.047812 -0.270627 0.321525 -0.168653 -0.234835 -0.206360 -0.135553 -0.161269 0.078441 0.097383 0.065132 0.094450 0.099765 0.099872 0.100539 0.107092 0.110912 0.105599 0.082927 0.096384 0.136527 0.140585 0.137896 0.128569 0.152982 0.142928 0.146537 0.106945 0.084067 0.102374 0.088994 0.083429 0.125291 0.143553 0.154815 0.155895 0.156459
qa: 0.4547 -0.2204 -0.3312 -0.3223 -0.2756 -0.1261 -0.1365 -0.4155 -0.4391 -0.0914 -0.1323 -0.1351 0.0683 -0.2723 -0.2532 0.3469 -0.2563 -0.2691 0.2762 -0.1064 0.1185 0.0478 -0.2706 0.3215 -0.1687 -0.2348 -0.2064 -0.1356 -0.1613 0.0784 0.0974 0.0651 0.0944 0.0998 0.0999 0.1005 0.1071 0.1109 0.1056 0.0829 0.0964 0.1365 0.1406 0.1379 0.1286 0.1530 0.1429 0.1465 0.1069 0.0841 0.1024 0.0890 0.0834 0.1253 0.1436 0.1548 0.1559 0.1565
va: 4.1408 1.0584 2.0687 2.0880 3.8488 3.8800 3.6989 3.8952 3.9052 3.8727 3.8123 3.8232 3.5865 3.8542 3.9576 3.6988 3.9041 3.9029 3.6128 3.8288 4.0180 3.8750 3.9044 3.6485 3.7877 3.9724 3.8987 3.8892 3.8849 1.0178 1.0131 1.0032 1.0078 1.0100 1.0095 1.0102 1.0065 1.0084 1.0092 1.0082 1.0068 0.9907 0.9810 1.0070 1.0218 0.9994 1.0036 0.9977 0.9911 0.9962 1.0119 1.0042 0.9998 0.9942 1.0096 0.9978 0.9899 0.9911
dispcorr: -0.037887395 hartree
energy: -1510.104137749931
dipole: -16.43972 15.83635 -0.60337 21.75172 -20.64650 1.10523 -9.95174 8.78668 -1.16506
magnitude: 1.71550 au
magnitude: 4.36046 debye
