program: Orca
programVersion: 5.0.2
elementType: Si F O O C C C C C C C C C C C C C C C C C C C C C C C C C H H H H H H H H H H H H H H H H H H H H H H H H H H H H H
charge: 0
multiplicity: 1
keywords: wb97x-d3
keywords: def2-TZVPP
keywords: def2/J RIJCOSX
keywords: DEFGRID2
keywords: scfconv7
keywords: smallprint printgap noloewdin
keywords: NOSOSCF
formula: C25H29FO2Si
InChI: InChI=1/C25H29FO2Si/c1-4-27-21-13-15-23(16-14-21)29(2,3)18-8-9-20-12-17-24(26)25(19-20)28-22-10-6-5-7-11-22/h5-7,10-17,19H,4,8-9,18H2,1-3H3
58 atoms
Si -3.377686 1.399758 0.524528
F  0.469992 -4.02239 -3.351754
O  2.082032 3.991378 0.844611
O  1.886515 -3.035065 -1.331725
C  -3.120751 -0.467408 0.367015
C  -2.341261 -1.10891 1.512225
C  -1.707043 2.259576 0.65409
C  -4.384551 1.774173 2.071486
C  -4.283637 2.008799 -1.007838
C  -2.199912 -2.631442 1.392582
C  -0.9990 2.280263 1.855703
C  -1.091985 2.868205 -0.446046
C  -1.492441 -3.051131 0.135102
C  0.262058 2.853417 1.970536
C  0.159953 3.450105 -0.356698
C  0.855304 3.436663 0.853811
C  -0.120436 -2.84439 0.008238
C  -2.185359 -3.606625 -0.935678
C  0.541695 -3.16414 -1.166637
C  -1.531481 -3.943661 -2.113296
C  -0.178685 -3.710541 -2.220592
C  2.891225 3.893829 2.009708
C  4.236428 4.500506 1.69847
C  2.535275 -1.908348 -0.90598
C  3.843971 -2.078126 -0.474297
C  1.961737 -0.643307 -0.948909
C  4.584141 -0.972724 -0.082368
C  2.713438 0.451655 -0.545456
C  4.022105 0.296134 -0.109809
H  -4.10711 -0.938855 0.277007
H  -2.614566 -0.657845 -0.585772
H  -2.828564 -0.892143 2.467521
H  -1.342644 -0.665958 1.576721
H  -4.594353 2.841946 2.164128
H  -5.345131 1.253931 2.047907
H  -3.874745 1.464627 2.986268
H  -3.747721 1.76109 -1.926549
H  -5.270536 1.545673 -1.080817
H  -4.434815 3.090177 -0.995508
H  -1.655861 -3.005429 2.264278
H  -3.191758 -3.089349 1.422877
H  -1.428168 1.835935 2.747203
H  -1.59505 2.892049 -1.406318
H  0.761162 2.83308 2.930075
H  0.615039 3.90987 -1.226066
H  0.439369 -2.427074 0.837949
H  -3.250893 -3.781813 -0.855471
H  -2.071547 -4.375645 -2.946241
H  3.00518 2.844318 2.302025
H  2.420441 4.42188 2.845715
H  4.733013 3.977906 0.879939
H  4.151541 5.555525 1.435614
H  4.877117 4.426796 2.577378
H  4.278548 -3.069711 -0.451134
H  0.945945 -0.498874 -1.295462
H  5.604459 -1.109523 0.252144
H  2.268817 1.437093 -0.584937
H  4.600422 1.156991 0.199397
elementType: Si F O C H
totalener: -1510.07174533 hartree
nucrepener: 2886.42631056 hartree
electener: -4396.49805590 hartree
oneelecener: -7802.85278784 hartree
twoeener: 3406.35473195 hartree
cpcmener: -0.02321657 hartree
kineticenergy: 1503.90591364 hartree
xcener: -135.228673029306 hartree
chargesum: -0.0000000
charge: 0.493943 -0.217885 -0.327023 -0.329533 -0.238921 -0.132265 -0.146660 -0.422177 -0.461161 -0.104574 -0.175671 -0.088634 0.002551 -0.211283 -0.285714 0.289579 -0.187658 -0.193892 0.193200 -0.161658 0.183554 0.045038 -0.273832 0.304305 -0.253719 -0.205527 -0.115166 -0.145432 -0.212103 0.082686 0.081583 0.091061 0.073016 0.107599 0.105432 0.097985 0.100314 0.105484 0.106786 0.097734 0.083275 0.140027 0.138414 0.136990 0.132539 0.145438 0.139406 0.147615 0.094211 0.105619 0.083905 0.091154 0.090303 0.144629 0.150911 0.156216 0.186978 0.161008
qa: 0.4939 -0.2179 -0.3270 -0.3295 -0.2389 -0.1323 -0.1467 -0.4222 -0.4612 -0.1046 -0.1757 -0.0886 0.0026 -0.2113 -0.2857 0.2896 -0.1877 -0.1939 0.1932 -0.1617 0.1836 0.0450 -0.2738 0.3043 -0.2537 -0.2055 -0.1152 -0.1454 -0.2121 0.0827 0.0816 0.0911 0.0730 0.1076 0.1054 0.0980 0.1003 0.1055 0.1068 0.0977 0.0833 0.1400 0.1384 0.1370 0.1325 0.1454 0.1394 0.1476 0.0942 0.1056 0.0839 0.0912 0.0903 0.1446 0.1509 0.1562 0.1870 0.1610
va: 4.1483 1.0681 2.0526 2.0800 3.8105 3.8765 3.7220 3.8885 3.9286 3.8662 3.9119 3.8410 3.6548 3.8907 3.9856 3.7458 3.9039 3.8711 3.6975 3.8821 4.0619 3.7942 3.9765 3.6929 4.0073 3.9209 3.8914 3.8581 3.9318 1.0156 1.0137 1.0069 1.0044 1.0078 1.0069 1.0114 1.0104 1.0104 1.0097 1.0061 1.0097 0.9894 0.9878 1.0108 1.0150 1.0046 1.0038 0.9980 0.9862 0.9886 1.0036 1.0040 1.0056 1.0084 1.0050 0.9902 0.9658 0.9889
dispcorr: -0.030868493 hartree
energy: -1510.102613823541
dipole: -12.08572 11.68551 -0.40021 24.96499 -24.36821 0.59678 20.70498 -18.97343 1.73156
magnitude: 1.87473 au
magnitude: 4.76518 debye
