program: Orca
programVersion: 5.0.2
elementType: Si F O O C C C C C C C C C C C C C C C C C C C C C C C C C H H H H H H H H H H H H H H H H H H H H H H H H H H H H H
charge: 0
multiplicity: 1
keywords: wb97x-d3
keywords: def2-TZVPP
keywords: def2/J RIJCOSX
keywords: DEFGRID2
keywords: scfconv7
keywords: smallprint printgap noloewdin
keywords: NOSOSCF
formula: C25H29FO2Si
InChI: InChI=1/C25H29FO2Si/c1-4-27-21-13-15-23(16-14-21)29(2,3)18-8-9-20-12-17-24(26)25(19-20)28-22-10-6-5-7-11-22/h5-7,10-17,19H,4,8-9,18H2,1-3H3
58 atoms
Si -3.074153 1.558628 -0.374632
F  1.683512 -4.510625 -1.352429
O  2.444914 3.453964 1.25543
O  1.67548 -2.374958 0.291762
C  -3.111792 -0.328049 -0.539747
C  -3.339964 -1.096009 0.763338
C  -1.356515 2.129619 0.154003
C  -4.33647 2.119628 0.908138
C  -3.479066 2.327809 -2.043981
C  -3.240531 -2.61388 0.615602
C  -0.651693 1.49434 1.177039
C  -0.722667 3.220664 -0.452579
C  -1.916183 -3.121303 0.104255
C  0.613643 1.901401 1.581343
C  0.534144 3.649731 -0.06484
C  1.2192 2.987526 0.954864
C  -0.716712 -2.503334 0.44834
C  -1.863569 -4.237587 -0.727801
C  0.491798 -2.969108 -0.042894
C  -0.658558 -4.72715 -1.209972
C  0.51015 -4.077317 -0.873907
C  3.158364 2.876248 2.341326
C  4.491203 3.574134 2.446137
C  2.018876 -1.191258 -0.301332
C  3.203115 -0.613686 0.143229
C  1.266051 -0.576341 -1.294068
C  3.63467 0.580045 -0.412904
C  1.709034 0.625765 -1.832823
C  2.889888 1.209745 -1.401826
H  -3.901713 -0.593001 -1.252222
H  -2.175755 -0.641329 -1.014583
H  -4.335023 -0.864208 1.151515
H  -2.647942 -0.763933 1.541695
H  -4.375745 3.20964 0.97024
H  -5.343855 1.771049 0.669059
H  -4.090866 1.750612 1.90631
H  -2.766787 2.029637 -2.816309
H  -4.469588 2.011672 -2.379689
H  -3.488783 3.419148 -2.009239
H  -3.448444 -3.075475 1.586738
H  -4.02927 -2.964034 -0.055581
H  -1.085079 0.645411 1.693379
H  -1.214907 3.760268 -1.253792
H  1.107147 1.359177 2.376649
H  0.999157 4.495803 -0.556948
H  -0.706453 -1.632762 1.094007
H  -2.781641 -4.738061 -1.010624
H  -0.629509 -5.59521 -1.856239
H  3.304034 1.803901 2.177278
H  2.589636 2.993517 3.270416
H  5.083872 3.445872 1.539567
H  4.37259 4.641756 2.634905
H  5.056955 3.150514 3.276168
H  3.783726 -1.102482 0.915874
H  0.343622 -1.010726 -1.656711
H  4.560424 1.021088 -0.065646
H  1.114187 1.104954 -2.599916
H  3.223345 2.147392 -1.826168
elementType: Si F O C H
totalener: -1510.06910277 hartree
nucrepener: 2993.00048387 hartree
electener: -4503.06958665 hartree
oneelecener: -8016.48295140 hartree
twoeener: 3513.41336475 hartree
cpcmener: -0.02549149 hartree
kineticenergy: 1503.90980033 hartree
xcener: -135.235888403688 hartree
chargesum: -0.0000000
charge: 0.489816 -0.216248 -0.326448 -0.331204 -0.269348 -0.125725 -0.161759 -0.419795 -0.455864 -0.111538 -0.197848 -0.086479 0.016094 -0.230126 -0.301993 0.356230 -0.233914 -0.169273 0.189429 -0.185943 0.226993 0.040348 -0.270777 0.349502 -0.250408 -0.226601 -0.138785 -0.175197 -0.162830 0.094662 0.079737 0.092234 0.083511 0.107446 0.106235 0.103239 0.107576 0.106088 0.099624 0.094034 0.084007 0.162202 0.137708 0.131988 0.127868 0.146413 0.140352 0.147908 0.089202 0.109610 0.084436 0.090981 0.090481 0.140351 0.155107 0.159028 0.156030 0.151634
qa: 0.4898 -0.2162 -0.3264 -0.3312 -0.2693 -0.1257 -0.1618 -0.4198 -0.4559 -0.1115 -0.1978 -0.0865 0.0161 -0.2301 -0.3020 0.3562 -0.2339 -0.1693 0.1894 -0.1859 0.2270 0.0403 -0.2708 0.3495 -0.2504 -0.2266 -0.1388 -0.1752 -0.1628 0.0947 0.0797 0.0922 0.0835 0.1074 0.1062 0.1032 0.1076 0.1061 0.0996 0.0940 0.0840 0.1622 0.1377 0.1320 0.1279 0.1464 0.1404 0.1479 0.0892 0.1096 0.0844 0.0910 0.0905 0.1404 0.1551 0.1590 0.1560 0.1516
va: 4.1098 1.0726 2.0504 2.0898 3.8513 3.8882 3.7468 3.8826 3.9201 3.8700 3.8369 3.7998 3.6487 3.8500 4.0375 3.6536 3.9264 3.9032 3.6980 3.8901 4.0499 3.8042 3.9694 3.6298 3.9546 3.8260 3.8517 3.8704 3.8253 1.0117 1.0130 1.0054 1.0015 1.0116 1.0055 1.0058 1.0080 1.0116 1.0107 1.0011 1.0060 0.9741 0.9879 1.0151 1.0172 1.0096 0.9999 0.9985 0.9810 0.9912 1.0048 1.0041 1.0055 1.0119 1.0043 0.9838 0.9941 0.9951
dispcorr: -0.035750835 hartree
energy: -1510.104853609374
dipole: -16.26743 15.21549 -1.05195 24.21839 -24.11661 0.10177 7.32860 -6.74609 0.58251
magnitude: 1.20676 au
magnitude: 3.06735 debye
