program: Orca
programVersion: 5.0.2
elementType: Si F O O C C C C C C C C C C C C C C C C C C C C C C C C C H H H H H H H H H H H H H H H H H H H H H H H H H H H H H
charge: 0
multiplicity: 1
keywords: wb97x-d3
keywords: def2-TZVPP
keywords: def2/J RIJCOSX
keywords: DEFGRID2
keywords: scfconv7
keywords: smallprint printgap noloewdin
keywords: NOSOSCF
formula: C25H29FO2Si
InChI: InChI=1/C25H29FO2Si/c1-4-27-21-13-15-23(16-14-21)29(2,3)18-8-9-20-12-17-24(26)25(19-20)28-22-10-6-5-7-11-22/h5-7,10-17,19H,4,8-9,18H2,1-3H3
58 atoms
Si -3.883289 1.233703 0.766232
F  1.955172 -3.6424 0.84301
O  1.930895 2.884464 0.574112
O  1.395825 -0.974668 0.604296
C  -3.805359 -0.556216 0.160772
C  -3.372454 -0.674972 -1.30292
C  -2.115974 1.877664 0.717006
C  -4.526169 1.29175 2.533291
C  -4.97324 2.26877 -0.365718
C  -2.821582 -2.046539 -1.682133
C  -1.588371 2.511502 -0.406784
C  -1.227954 1.628762 1.770706
C  -1.549974 -2.453083 -0.978225
C  -0.247238 2.866216 -0.503945
C  0.108011 1.976772 1.700621
C  0.616538 2.589738 0.553125
C  -0.619764 -1.516401 -0.530854
C  -1.261112 -3.803514 -0.795845
C  0.552664 -1.915413 0.089554
C  -0.081379 -4.217698 -0.19427
C  0.813728 -3.268667 0.247548
C  2.550829 3.456863 -0.571451
C  2.832422 2.447162 -1.663478
C  2.671846 -0.867975 0.126912
C  3.581155 -0.216829 0.951482
C  3.058006 -1.338524 -1.120778
C  4.888237 -0.046683 0.52392
C  4.372712 -1.162555 -1.532733
C  5.293472 -0.52057 -0.717734
H  -3.097618 -1.077537 0.81546
H  -4.766651 -1.059894 0.306886
H  -2.629642 0.087564 -1.557437
H  -4.227728 -0.461912 -1.948841
H  -3.95008 0.646891 3.200448
H  -4.490041 2.302956 2.943861
H  -5.56449 0.956224 2.584665
H  -6.00204 1.901083 -0.357139
H  -4.999652 3.314964 -0.053404
H  -4.635138 2.248172 -1.403836
H  -3.582654 -2.809568 -1.496863
H  -2.638852 -2.066173 -2.761981
H  -2.22811 2.739354 -1.252386
H  -1.578676 1.143961 2.675503
H  0.098016 3.34844 -1.408564
H  0.771617 1.772614 2.532518
H  -0.795713 -0.452996 -0.643321
H  -1.969726 -4.552363 -1.128005
H  0.134553 -5.269474 -0.055722
H  3.489343 3.871237 -0.202309
H  1.961243 4.298007 -0.948828
H  3.326761 2.950152 -2.496073
H  3.499423 1.661526 -1.309685
H  1.927899 1.978988 -2.052376
H  3.26501 0.147727 1.920887
H  2.351629 -1.831004 -1.777351
H  5.594707 0.459226 1.169401
H  4.672423 -1.531559 -2.505265
H  6.315587 -0.38758 -1.046815
elementType: Si F O C H
totalener: -1510.06799267 hartree
nucrepener: 2999.82145816 hartree
electener: -4509.88945083 hartree
oneelecener: -8030.87459906 hartree
twoeener: 3520.98514823 hartree
cpcmener: -0.02367745 hartree
kineticenergy: 1503.91505513 hartree
xcener: -135.236325098985 hartree
chargesum: -0.0000000
charge: 0.487827 -0.217511 -0.333780 -0.313697 -0.270150 -0.105604 -0.152913 -0.450771 -0.428811 -0.119995 -0.161467 -0.088094 0.003947 -0.229281 -0.321763 0.343358 -0.180290 -0.165623 0.136422 -0.185855 0.257745 0.038504 -0.245097 0.316696 -0.295196 -0.192837 -0.101938 -0.143149 -0.185758 0.085424 0.092638 0.075308 0.093272 0.099345 0.104596 0.103606 0.107234 0.109630 0.100445 0.085608 0.093801 0.142775 0.133682 0.136627 0.133179 0.110957 0.139406 0.146520 0.110092 0.094766 0.104550 0.047957 0.095163 0.144186 0.148867 0.154431 0.156437 0.154578
qa: 0.4878 -0.2175 -0.3338 -0.3137 -0.2702 -0.1056 -0.1529 -0.4508 -0.4288 -0.1200 -0.1615 -0.0881 0.0039 -0.2293 -0.3218 0.3434 -0.1803 -0.1656 0.1364 -0.1859 0.2577 0.0385 -0.2451 0.3167 -0.2952 -0.1928 -0.1019 -0.1431 -0.1858 0.0854 0.0926 0.0753 0.0933 0.0993 0.1046 0.1036 0.1072 0.1096 0.1004 0.0856 0.0938 0.1428 0.1337 0.1366 0.1332 0.1110 0.1394 0.1465 0.1101 0.0948 0.1046 0.0480 0.0952 0.1442 0.1489 0.1544 0.1564 0.1546
va: 4.1416 1.0692 2.0570 2.0549 3.8251 3.8749 3.6951 3.9146 3.8970 3.8763 3.8801 3.8413 3.6714 3.8969 3.9976 3.7086 3.9110 3.8999 3.7668 3.9370 3.9880 3.8482 3.9144 3.5789 3.9645 3.8798 3.8547 3.8893 3.8843 1.0091 1.0133 0.9978 1.0040 1.0113 1.0098 1.0114 1.0081 1.0084 1.0089 1.0031 1.0001 0.9885 0.9905 1.0059 1.0126 1.0225 0.9998 0.9996 0.9924 0.9986 1.0145 1.0118 1.0009 1.0112 1.0060 0.9909 0.9915 0.9917
dispcorr: -0.034879807 hartree
energy: -1510.102872475717
dipole: -20.01866 19.41780 -0.60085 17.40909 -17.29315 0.11593 -9.33284 7.77692 -1.55592
magnitude: 1.67193 au
magnitude: 4.24972 debye
