program: Orca
programVersion: 5.0.2
elementType: Si F O O C C C C C C C C C C C C C C C C C C C C C C C C C H H H H H H H H H H H H H H H H H H H H H H H H H H H H H
charge: 0
multiplicity: 1
keywords: wb97x-d3
keywords: def2-TZVPP
keywords: def2/J RIJCOSX
keywords: DEFGRID2
keywords: scfconv7
keywords: smallprint printgap noloewdin
keywords: NOSOSCF
formula: C25H29FO2Si
InChI: InChI=1/C25H29FO2Si/c1-4-27-21-13-15-23(16-14-21)29(2,3)18-8-9-20-12-17-24(26)25(19-20)28-22-10-6-5-7-11-22/h5-7,10-17,19H,4,8-9,18H2,1-3H3
58 atoms
Si -3.535546 1.24639 0.843839
F  0.957428 -4.939177 0.891541
O  1.794736 4.087598 0.483643
O  1.723114 -2.444317 0.44133
C  -3.311548 -0.401764 -0.05187
C  -2.713542 -0.267722 -1.450837
C  -1.878181 2.14068 0.797717
C  -4.052815 0.91815 2.625024
C  -4.837608 2.292907 -0.022343
C  -2.415709 -1.605133 -2.132992
C  -0.687595 1.436861 0.980287
C  -1.763913 3.508839 0.530809
C  -1.507771 -2.504619 -1.336615
C  0.559367 2.042471 0.889741
C  -0.534514 4.137507 0.441811
C  0.641393 3.405528 0.6111
C  -0.282298 -2.03663 -0.862255
C  -1.882057 -3.809702 -1.036966
C  0.551177 -2.854872 -0.115624
C  -1.05741 -4.639261 -0.288586
C  0.150111 -4.15632 0.161035
C  3.021133 3.36777 0.499698
C  4.140986 4.33954 0.224477
C  2.594525 -1.634478 -0.231316
C  3.390155 -0.809277 0.554129
C  2.746933 -1.657466 -1.612037
C  4.34614 -0.004921 -0.047713
C  3.698502 -0.83519 -2.200185
C  4.500871 -0.007253 -1.427641
H  -2.67546 -1.040204 0.571481
H  -4.278212 -0.916167 -0.101842
H  -1.79522 0.324375 -1.40989
H  -3.394802 0.295709 -2.094977
H  -4.205376 1.847704 3.177966
H  -4.986257 0.352538 2.675121
H  -3.294105 0.342069 3.159868
H  -4.561274 2.52474 -1.052958
H  -5.792786 1.763254 -0.055575
H  -5.017192 3.240482 0.490046
H  -3.352885 -2.132531 -2.326987
H  -1.966999 -1.407933 -3.111751
H  -0.711896 0.372757 1.192629
H  -2.653278 4.10852 0.372176
H  1.446127 1.438014 1.029523
H  -0.474691 5.197605 0.225526
H  0.023248 -1.017173 -1.068766
H  -2.833652 -4.190041 -1.386617
H  -1.352359 -5.654688 -0.056352
H  3.004724 2.58205 -0.262959
H  3.16571 2.884465 1.471907
H  4.031005 4.810949 -0.752806
H  4.192866 5.120968 0.983479
H  5.091154 3.80448 0.231375
H  3.265549 -0.807521 1.629954
H  2.142191 -2.307044 -2.231781
H  4.968718 0.631127 0.568978
H  3.812496 -0.850866 -3.276517
H  5.24261 0.626417 -1.895694
elementType: Si F O C H
totalener: -1510.07028531 hartree
nucrepener: 2903.61737054 hartree
electener: -4413.68765586 hartree
oneelecener: -7836.94998045 hartree
twoeener: 3423.26232460 hartree
cpcmener: -0.02281323 hartree
kineticenergy: 1503.90552579 hartree
xcener: -135.231425167743 hartree
chargesum: 0.0000000
charge: 0.477442 -0.217506 -0.328072 -0.328369 -0.274579 -0.126060 -0.153722 -0.416391 -0.444362 -0.108833 -0.185200 -0.091646 0.007890 -0.235793 -0.281164 0.328461 -0.282624 -0.172119 0.286310 -0.165427 0.167356 0.074099 -0.270097 0.318801 -0.258270 -0.199424 -0.162135 -0.147906 -0.164493 0.087277 0.090311 0.079908 0.092447 0.100383 0.100718 0.100785 0.106548 0.108515 0.104349 0.081053 0.096536 0.142156 0.136236 0.146214 0.131362 0.146272 0.137314 0.147409 0.078224 0.095438 0.088255 0.089574 0.087856 0.145641 0.155073 0.160689 0.159187 0.158103
qa: 0.4774 -0.2175 -0.3281 -0.3284 -0.2746 -0.1261 -0.1537 -0.4164 -0.4444 -0.1088 -0.1852 -0.0916 0.0079 -0.2358 -0.2812 0.3285 -0.2826 -0.1721 0.2863 -0.1654 0.1674 0.0741 -0.2701 0.3188 -0.2583 -0.1994 -0.1621 -0.1479 -0.1645 0.0873 0.0903 0.0799 0.0924 0.1004 0.1007 0.1008 0.1065 0.1085 0.1043 0.0811 0.0965 0.1422 0.1362 0.1462 0.1314 0.1463 0.1373 0.1474 0.0782 0.0954 0.0883 0.0896 0.0879 0.1456 0.1551 0.1607 0.1592 0.1581
va: 4.1434 1.0685 2.0899 2.0731 3.8450 3.8499 3.7309 3.8837 3.9081 3.8501 3.8808 3.8630 3.6880 3.8460 4.0492 3.7722 3.9046 3.8824 3.5746 3.8776 4.0719 3.8084 3.9714 3.6663 3.9282 3.8958 3.8565 3.9089 3.8639 1.0107 1.0163 1.0039 1.0074 1.0098 1.0086 1.0091 1.0066 1.0083 1.0089 1.0080 1.0028 0.9889 0.9887 1.0217 1.0153 0.9955 1.0025 0.9985 0.9904 0.9819 1.0035 1.0040 1.0061 1.0104 0.9966 0.9857 0.9897 0.9901
dispcorr: -0.031604403 hartree
energy: -1510.101889717723
dipole: -12.99438 12.89289 -0.10149 25.50423 -25.24191 0.26232 -3.83564 2.82096 -1.01468
magnitude: 1.05294 au
magnitude: 2.67637 debye
