program: Orca
programVersion: 5.0.2
elementType: Si F O O C C C C C C C C C C C C C C C C C C C C C C C C C H H H H H H H H H H H H H H H H H H H H H H H H H H H H H
charge: 0
multiplicity: 1
keywords: wb97x-d3
keywords: def2-TZVPP
keywords: def2/J RIJCOSX
keywords: DEFGRID2
keywords: scfconv7
keywords: smallprint printgap noloewdin
keywords: NOSOSCF
formula: C25H29FO2Si
InChI: InChI=1/C25H29FO2Si/c1-4-27-21-13-15-23(16-14-21)29(2,3)18-8-9-20-12-17-24(26)25(19-20)28-22-10-6-5-7-11-22/h5-7,10-17,19H,4,8-9,18H2,1-3H3
58 atoms
Si -3.434593 1.810865 0.446811
F  1.405402 -5.444983 0.25523
O  2.343417 3.621826 0.195541
O  2.124899 -2.938152 -0.356515
C  -3.644127 0.344195 -0.726212
C  -2.740794 -0.832776 -0.357559
C  -1.642065 2.386329 0.324097
C  -3.767609 1.291984 2.226544
C  -4.608055 3.2049 -0.029354
C  -2.516372 -1.829905 -1.49888
C  -1.025288 3.092317 1.363629
C  -0.854534 2.115241 -0.794131
C  -1.475765 -2.844873 -1.117971
C  0.294191 3.501343 1.291545
C  0.475113 2.508479 -0.888784
C  1.061963 3.208628 0.162342
C  -0.151449 -2.434866 -0.980077
C  -1.799486 -4.163024 -0.818067
C  0.819901 -3.300496 -0.507331
C  -0.828559 -5.051402 -0.373447
C  0.465215 -4.60849 -0.205669
C  3.185935 3.422082 -0.933204
C  2.943257 4.433534 -2.033107
C  2.432462 -1.755362 0.263161
C  1.652162 -1.208123 1.275178
C  3.608377 -1.134232 -0.135516
C  2.057415 -0.025322 1.878214
C  4.007583 0.039068 0.488303
C  3.234446 0.602203 1.494427
H  -4.693079 0.03187 -0.750226
H  -3.420794 0.686252 -1.743658
H  -3.153602 -1.361034 0.506646
H  -1.76029 -0.467568 -0.036312
H  -3.048834 0.547645 2.575361
H  -3.714027 2.139864 2.913139
H  -4.764991 0.858887 2.3323
H  -4.47246 4.076959 0.614383
H  -4.44895 3.533312 -1.058676
H  -5.652311 2.8956 0.05777
H  -3.454742 -2.325187 -1.759412
H  -2.191318 -1.282273 -2.388457
H  -1.580921 3.333127 2.263654
H  -1.272015 1.572342 -1.635018
H  0.744247 4.045691 2.11333
H  1.02756 2.256312 -1.783872
H  0.121972 -1.413638 -1.222605
H  -2.820908 -4.506271 -0.924745
H  -1.079296 -6.077959 -0.138678
H  3.099122 2.398281 -1.308265
H  4.199948 3.530624 -0.547544
H  3.081105 5.451804 -1.66803
H  3.660648 4.269015 -2.838369
H  1.944358 4.35822 -2.463194
H  0.738047 -1.68884 1.59915
H  4.208138 -1.570344 -0.924667
H  1.445903 0.401641 2.662603
H  4.927797 0.516838 0.177629
H  3.545997 1.519354 1.975883
elementType: Si F O C H
totalener: -1510.06859306 hartree
nucrepener: 2923.25725016 hartree
electener: -4433.32584321 hartree
oneelecener: -7876.59987621 hartree
twoeener: 3443.27403299 hartree
cpcmener: -0.02416336 hartree
kineticenergy: 1503.90637754 hartree
xcener: -135.230741328967 hartree
chargesum: -0.0000000
charge: 0.486990 -0.217384 -0.333724 -0.332602 -0.269591 -0.151367 -0.139565 -0.438649 -0.420236 -0.056297 -0.099511 -0.168426 0.024961 -0.294697 -0.217284 0.310857 -0.228539 -0.202622 0.208786 -0.162202 0.180812 0.044052 -0.265091 0.303173 -0.194641 -0.233898 -0.165827 -0.155023 -0.155956 0.095243 0.077711 0.100098 0.064820 0.107747 0.105605 0.110370 0.099334 0.100855 0.100813 0.084121 0.088061 0.131959 0.139330 0.130757 0.136805 0.144527 0.140439 0.147226 0.080569 0.113077 0.089632 0.094192 0.090809 0.154156 0.145757 0.156988 0.158453 0.154042
qa: 0.4870 -0.2174 -0.3337 -0.3326 -0.2696 -0.1514 -0.1396 -0.4386 -0.4202 -0.0563 -0.0995 -0.1684 0.0250 -0.2947 -0.2173 0.3109 -0.2285 -0.2026 0.2088 -0.1622 0.1808 0.0441 -0.2651 0.3032 -0.1946 -0.2339 -0.1658 -0.1550 -0.1560 0.0952 0.0777 0.1001 0.0648 0.1077 0.1056 0.1104 0.0993 0.1009 0.1008 0.0841 0.0881 0.1320 0.1393 0.1308 0.1368 0.1445 0.1404 0.1472 0.0806 0.1131 0.0896 0.0942 0.0908 0.1542 0.1458 0.1570 0.1585 0.1540
va: 4.1356 1.0691 2.0425 2.0845 3.8664 3.8727 3.7160 3.8910 3.8946 3.7960 3.8668 3.8669 3.6648 4.0328 3.8542 3.7014 3.9163 3.9133 3.6833 3.8701 4.0674 3.8420 3.9486 3.6858 3.8742 3.9960 3.8728 3.8722 3.8172 1.0140 1.0159 1.0089 0.9928 1.0048 1.0103 1.0079 1.0102 1.0093 1.0092 1.0139 1.0099 0.9912 0.9900 1.0160 1.0072 1.0026 1.0035 0.9984 0.9945 0.9890 1.0052 1.0075 1.0022 0.9985 1.0074 0.9948 0.9896 0.9989
dispcorr: -0.032692895 hartree
energy: -1510.101285951323
dipole: -18.47079 17.68411 -0.78668 31.10592 -30.22890 0.87703 -3.69855 2.92112 -0.77743
magnitude: 1.41154 au
magnitude: 3.58785 debye
