program: Orca
programVersion: 5.0.2
elementType: Si F O O C C C C C C C C C C C C C C C C C C C C C C C C C H H H H H H H H H H H H H H H H H H H H H H H H H H H H H
charge: 0
multiplicity: 1
keywords: wb97x-d3
keywords: def2-TZVPP
keywords: def2/J RIJCOSX
keywords: DEFGRID2
keywords: scfconv7
keywords: smallprint printgap noloewdin
keywords: NOSOSCF
formula: C25H29FO2Si
InChI: InChI=1/C25H29FO2Si/c1-4-27-21-13-15-23(16-14-21)29(2,3)18-8-9-20-12-17-24(26)25(19-20)28-22-10-6-5-7-11-22/h5-7,10-17,19H,4,8-9,18H2,1-3H3
58 atoms
Si -3.687268 -0.251707 0.611791
F  3.047408 0.763341 0.361565
O  0.863912 2.423375 3.56891
O  2.214904 -1.430402 -0.896497
C  -3.073745 -0.377131 -1.167839
C  -2.87228 0.993522 -1.8285
C  -2.298377 0.560417 1.590481
C  -4.023171 -1.973051 1.295899
C  -5.240029 0.806985 0.700024
C  -1.635624 1.070681 -2.731327
C  -2.340463 1.89666 2.001994
C  -1.131786 -0.147432 1.881492
C  -0.360812 0.991532 -1.937464
C  -1.280237 2.494189 2.660698
C  -0.055434 0.427574 2.545233
C  -0.123825 1.763351 2.935851
C  0.358522 -0.195832 -1.850189
C  0.086817 2.098895 -1.217861
C  1.507769 -0.279931 -1.0735
C  1.23095 2.028436 -0.439845
C  1.934883 0.844061 -0.384777
C  2.065746 1.732121 3.883883
C  2.989044 2.697974 4.583782
C  2.417117 -2.281402 -1.950004
C  2.377578 -3.640885 -1.674229
C  2.703862 -1.825208 -3.230676
C  2.628017 -4.55097 -2.691126
C  2.940351 -2.74767 -4.239658
C  2.90344 -4.11077 -3.978309
H  -2.129704 -0.931734 -1.126238
H  -3.743477 -0.994725 -1.773489
H  -2.786687 1.791906 -1.082718
H  -3.75755 1.2446 -2.417271
H  -4.812492 -2.473535 0.729883
H  -3.138824 -2.612014 1.245679
H  -4.342235 -1.938687 2.3397
H  -5.59919 0.922849 1.724762
H  -5.086275 1.808439 0.292592
H  -6.048651 0.34952 0.124984
H  -1.66867 0.266319 -3.470256
H  -1.657299 2.011518 -3.287324
H  -3.221282 2.49832 1.80753
H  -1.038454 -1.187286 1.585884
H  -1.338814 3.532468 2.965276
H  0.821452 -0.174919 2.740552
H  0.017398 -1.068684 -2.394581
H  -0.462214 3.031305 -1.264025
H  1.582382 2.8885 0.115941
H  2.534259 1.351157 2.97116
H  1.851131 0.874041 4.529867
H  3.917797 2.187868 4.840115
H  3.240269 3.546748 3.946752
H  2.550123 3.074925 5.508243
H  2.155969 -3.981917 -0.670593
H  2.747928 -0.765099 -3.446823
H  2.598955 -5.610874 -2.473296
H  3.160675 -2.392216 -5.238009
H  3.090342 -4.823182 -4.77092
elementType: Si F O C H
totalener: -1510.06970333 hartree
nucrepener: 2947.17965970 hartree
electener: -4457.24936303 hartree
oneelecener: -7925.20880233 hartree
twoeener: 3467.95943929 hartree
cpcmener: -0.02319525 hartree
kineticenergy: 1503.91016158 hartree
xcener: -135.231589783775 hartree
chargesum: -0.0000000
charge: 0.481216 -0.223806 -0.326058 -0.333519 -0.267856 -0.131366 -0.128340 -0.444393 -0.429331 -0.096459 -0.095912 -0.194098 0.100279 -0.284651 -0.251659 0.349305 -0.238920 -0.276640 0.254571 -0.137636 0.158401 0.058618 -0.272929 0.282742 -0.251166 -0.187071 -0.120984 -0.147416 -0.185226 0.078792 0.094673 0.066118 0.092072 0.102282 0.100167 0.103185 0.110146 0.099710 0.107715 0.087012 0.095833 0.140753 0.135173 0.130747 0.135435 0.146266 0.139951 0.149914 0.088099 0.096965 0.089108 0.086708 0.087579 0.145600 0.155030 0.157951 0.159371 0.157950
qa: 0.4812 -0.2238 -0.3261 -0.3335 -0.2679 -0.1314 -0.1283 -0.4444 -0.4293 -0.0965 -0.0959 -0.1941 0.1003 -0.2847 -0.2517 0.3493 -0.2389 -0.2766 0.2546 -0.1376 0.1584 0.0586 -0.2729 0.2827 -0.2512 -0.1871 -0.1210 -0.1474 -0.1852 0.0788 0.0947 0.0661 0.0921 0.1023 0.1002 0.1032 0.1101 0.0997 0.1077 0.0870 0.0958 0.1408 0.1352 0.1307 0.1354 0.1463 0.1400 0.1499 0.0881 0.0970 0.0891 0.0867 0.0876 0.1456 0.1550 0.1580 0.1594 0.1580
va: 4.1419 1.0592 2.0702 2.0691 3.8195 3.8982 3.6938 3.9040 3.9103 3.8538 3.8347 3.9010 3.5683 4.0333 3.8450 3.6990 3.9068 3.8992 3.6573 3.7878 3.9958 3.7895 3.9760 3.7052 4.0093 3.9014 3.8853 3.8908 3.9058 1.0151 1.0125 1.0057 1.0092 1.0106 1.0114 1.0093 1.0073 1.0086 1.0089 1.0078 1.0053 0.9869 0.9936 1.0152 1.0120 1.0043 1.0042 0.9956 0.9917 0.9896 1.0059 1.0035 1.0039 1.0083 0.9984 0.9891 0.9903 0.9906
dispcorr: -0.032634030 hartree
energy: -1510.102337362935
dipole: -22.07720 21.64884 -0.42836 1.27238 -1.61595 -0.34357 3.79164 -4.72854 -0.93690
magnitude: 1.08596 au
magnitude: 2.76029 debye
