program: Orca
programVersion: 5.0.2
elementType: Si F O O C C C C C C C C C C C C C C C C C C C C C C C C C H H H H H H H H H H H H H H H H H H H H H H H H H H H H H
charge: 0
multiplicity: 1
keywords: wb97x-d3
keywords: def2-TZVPP
keywords: def2/J RIJCOSX
keywords: DEFGRID2
keywords: scfconv7
keywords: smallprint printgap noloewdin
keywords: NOSOSCF
formula: C25H29FO2Si
InChI: InChI=1/C25H29FO2Si/c1-4-27-21-13-15-23(16-14-21)29(2,3)18-8-9-20-12-17-24(26)25(19-20)28-22-10-6-5-7-11-22/h5-7,10-17,19H,4,8-9,18H2,1-3H3
58 atoms
Si -3.448562 1.812874 0.448217
F  1.363075 -5.501006 0.260545
O  2.317955 3.670027 0.291577
O  2.123777 -3.015683 -0.370395
C  -3.626115 0.352016 -0.737576
C  -2.720026 -0.820473 -0.363151
C  -1.660155 2.406047 0.357843
C  -3.808557 1.277813 2.217811
C  -4.629801 3.196659 -0.03897
C  -2.506751 -1.829472 -1.495845
C  -1.055124 3.086775 1.420819
C  -0.863767 2.172667 -0.762832
C  -1.480838 -2.856853 -1.107641
C  0.261855 3.506972 1.36911
C  0.463064 2.579028 -0.837818
C  1.038818 3.251473 0.237328
C  -0.149125 -2.468343 -0.976914
C  -1.825768 -4.167783 -0.79933
C  0.81025 -3.349713 -0.507854
C  -0.867929 -5.070913 -0.35586
C  0.434409 -4.65034 -0.198647
C  3.162367 3.531038 -0.844977
C  2.906097 4.590079 -1.896132
C  2.465876 -1.81969 0.203804
C  1.720896 -1.229877 1.218532
C  3.641413 -1.231379 -0.242594
C  2.162913 -0.038769 1.777892
C  4.077325 -0.048474 0.33704
C  3.34111 0.555608 1.347087
H  -4.672114 0.031045 -0.777624
H  -3.391297 0.700792 -1.750161
H  -3.126861 -1.340003 0.509212
H  -1.737189 -0.451387 -0.053672
H  -3.089739 0.537592 2.575093
H  -3.777484 2.120898 2.911638
H  -4.803498 0.834001 2.300469
H  -5.671755 2.874709 0.027592
H  -4.515725 4.065347 0.613429
H  -4.456977 3.534837 -1.062929
H  -3.451491 -2.314369 -1.753031
H  -2.174617 -1.292846 -2.389559
H  -1.618147 3.297389 2.323769
H  -1.272571 1.652226 -1.621971
H  0.703216 4.029687 2.209493
H  1.022476 2.360585 -1.737475
H  0.140249 -1.453482 -1.227603
H  -2.853545 -4.493944 -0.898839
H  -1.135606 -6.091504 -0.113488
H  3.087781 2.524735 -1.267385
H  4.175374 3.633164 -0.454905
H  1.907371 4.523086 -2.328247
H  3.032526 5.591845 -1.48383
H  3.624315 4.47193 -2.708776
H  0.807621 -1.685845 1.579209
H  4.212338 -1.700414 -1.034301
H  1.579947 0.420807 2.565644
H  4.99655 0.405047 -0.011121
H  3.682182 1.478918 1.795682
elementType: Si F O C H
totalener: -1510.06907046 hartree
nucrepener: 2912.46964017 hartree
electener: -4422.53871062 hartree
oneelecener: -7855.00424420 hartree
twoeener: 3432.46553358 hartree
cpcmener: -0.02402642 hartree
kineticenergy: 1503.90038682 hartree
xcener: -135.229324588831 hartree
chargesum: 0.0000000
charge: 0.486793 -0.217564 -0.333964 -0.331685 -0.271090 -0.149383 -0.144125 -0.440475 -0.419620 -0.054315 -0.097274 -0.163255 0.021676 -0.296248 -0.217074 0.308693 -0.224865 -0.202941 0.208347 -0.162330 0.179501 0.043604 -0.264479 0.304303 -0.194879 -0.239236 -0.162819 -0.143317 -0.164050 0.094947 0.077622 0.099288 0.066472 0.107973 0.105927 0.110450 0.100686 0.099457 0.100834 0.083548 0.088037 0.132505 0.139668 0.131157 0.136735 0.143333 0.140265 0.147203 0.080481 0.112881 0.090798 0.089641 0.094068 0.154143 0.145301 0.156599 0.157365 0.154692
qa: 0.4868 -0.2176 -0.3340 -0.3317 -0.2711 -0.1494 -0.1441 -0.4405 -0.4196 -0.0543 -0.0973 -0.1633 0.0217 -0.2962 -0.2171 0.3087 -0.2249 -0.2029 0.2083 -0.1623 0.1795 0.0436 -0.2645 0.3043 -0.1949 -0.2392 -0.1628 -0.1433 -0.1640 0.0949 0.0776 0.0993 0.0665 0.1080 0.1059 0.1104 0.1007 0.0995 0.1008 0.0835 0.0880 0.1325 0.1397 0.1312 0.1367 0.1433 0.1403 0.1472 0.0805 0.1129 0.0908 0.0896 0.0941 0.1541 0.1453 0.1566 0.1574 0.1547
va: 4.1371 1.0687 2.0417 2.0839 3.8659 3.8701 3.7219 3.8920 3.8929 3.7940 3.8675 3.8619 3.6707 4.0376 3.8540 3.7031 3.9127 3.9121 3.6869 3.8717 4.0656 3.8422 3.9505 3.6825 3.8810 4.0019 3.8718 3.8670 3.8305 1.0141 1.0160 1.0085 0.9939 1.0046 1.0101 1.0077 1.0092 1.0101 1.0092 1.0138 1.0099 0.9908 0.9899 1.0158 1.0073 1.0037 1.0036 0.9984 0.9946 0.9884 1.0022 1.0052 1.0075 0.9984 1.0075 0.9947 0.9903 0.9985
dispcorr: -0.032241536 hartree
energy: -1510.101311991905
dipole: -18.40458 17.65286 -0.75172 31.74769 -30.80227 0.94542 -3.64059 2.84526 -0.79533
magnitude: 1.44618 au
magnitude: 3.67590 debye
