program: Orca
programVersion: 5.0.2
elementType: Si F O O C C C C C C C C C C C C C C C C C C C C C C C C C H H H H H H H H H H H H H H H H H H H H H H H H H H H H H
charge: 0
multiplicity: 1
keywords: wb97x-d3
keywords: def2-TZVPP
keywords: def2/J RIJCOSX
keywords: DEFGRID2
keywords: scfconv7
keywords: smallprint printgap noloewdin
keywords: NOSOSCF
formula: C25H29FO2Si
InChI: InChI=1/C25H29FO2Si/c1-4-27-21-13-15-23(16-14-21)29(2,3)18-8-9-20-12-17-24(26)25(19-20)28-22-10-6-5-7-11-22/h5-7,10-17,19H,4,8-9,18H2,1-3H3
58 atoms
Si -3.48392 1.305767 0.789765
F  1.011644 -4.888961 1.009342
O  2.057602 3.669205 1.394158
O  2.107041 -3.107988 -0.610518
C  -3.257343 -0.365023 -0.062954
C  -2.574541 -0.291008 -1.425934
C  -1.788476 2.100291 0.983737
C  -4.243527 1.017283 2.488882
C  -4.592161 2.430412 -0.233365
C  -2.369698 -1.654495 -2.100302
C  -1.465948 3.328193 0.411153
C  -0.768898 1.451245 1.691875
C  -1.474871 -2.561001 -1.303357
C  -0.199381 3.893148 0.518255
C  0.497113 1.993114 1.814793
C  0.797079 3.221895 1.220858
C  -0.092017 -2.393056 -1.354854
C  -1.998909 -3.54247 -0.46835
C  0.749396 -3.170804 -0.573459
C  -1.167049 -4.335075 0.311121
C  0.193792 -4.135344 0.259049
C  2.509163 4.817656 0.686005
C  2.79538 4.535198 -0.773268
C  2.76258 -1.924561 -0.814593
C  2.341901 -0.723669 -0.256909
C  3.930337 -1.987546 -1.562349
C  3.10107 0.419144 -0.464553
C  4.683345 -0.838484 -1.752605
C  4.270563 0.370495 -1.210374
H  -2.682672 -1.007525 0.613624
H  -4.238306 -0.845101 -0.160792
H  -1.602543 0.203603 -1.331211
H  -3.164478 0.333709 -2.103198
H  -3.607607 0.383399 3.111123
H  -4.395208 1.954887 3.027653
H  -5.215242 0.523406 2.413157
H  -4.767358 3.388532 0.260451
H  -4.179111 2.641051 -1.221649
H  -5.569523 1.96645 -0.38606
H  -3.340934 -2.133399 -2.249182
H  -1.942709 -1.496149 -3.094099
H  -2.213616 3.879513 -0.147758
H  -0.956624 0.490982 2.161366
H  -0.015746 4.848687 0.045636
H  1.26627 1.468439 2.369274
H  0.330316 -1.645727 -2.016749
H  -3.069711 -3.695351 -0.421122
H  -1.574194 -5.098953 0.961364
H  3.427388 5.113626 1.193573
H  1.805729 5.647789 0.799783
H  3.171795 5.442557 -1.247762
H  3.558844 3.763724 -0.882173
H  1.909325 4.219768 -1.324825
H  1.438734 -0.669561 0.338148
H  4.248579 -2.932263 -1.985159
H  2.77777 1.353937 -0.026201
H  5.595478 -0.892289 -2.332788
H  4.85711 1.26683 -1.363727
elementType: Si F O C H
totalener: -1510.06965656 hartree
nucrepener: 2893.95965284 hartree
electener: -4404.02930940 hartree
oneelecener: -7817.96720915 hartree
twoeener: 3413.93789975 hartree
cpcmener: -0.02305432 hartree
kineticenergy: 1503.90086299 hartree
xcener: -135.229693073148 hartree
chargesum: 0.0000000
charge: 0.495050 -0.218503 -0.338325 -0.325528 -0.265294 -0.126059 -0.187032 -0.426349 -0.449131 -0.099721 -0.123768 -0.094843 0.039946 -0.242293 -0.320497 0.350208 -0.226512 -0.236478 0.226872 -0.141198 0.164481 0.039760 -0.269432 0.327828 -0.252799 -0.273849 -0.055715 -0.086348 -0.245618 0.082647 0.087324 0.076012 0.086074 0.100563 0.102480 0.101577 0.108418 0.101608 0.109851 0.085898 0.095251 0.142678 0.134194 0.139221 0.138570 0.146083 0.141718 0.148038 0.108457 0.090758 0.102794 0.081236 0.095329 0.151733 0.143719 0.147044 0.157309 0.154562
qa: 0.4950 -0.2185 -0.3383 -0.3255 -0.2653 -0.1261 -0.1870 -0.4263 -0.4491 -0.0997 -0.1238 -0.0948 0.0399 -0.2423 -0.3205 0.3502 -0.2265 -0.2365 0.2269 -0.1412 0.1645 0.0398 -0.2694 0.3278 -0.2528 -0.2738 -0.0557 -0.0863 -0.2456 0.0826 0.0873 0.0760 0.0861 0.1006 0.1025 0.1016 0.1084 0.1016 0.1099 0.0859 0.0953 0.1427 0.1342 0.1392 0.1386 0.1461 0.1417 0.1480 0.1085 0.0908 0.1028 0.0812 0.0953 0.1517 0.1437 0.1470 0.1573 0.1546
va: 4.1417 1.0663 2.0676 2.0872 3.8373 3.8571 3.7679 3.8971 3.9215 3.8551 3.8580 3.8326 3.6305 3.8971 3.9992 3.6885 3.9188 3.8837 3.6797 3.8655 4.0635 3.8629 3.9098 3.7039 3.9696 4.0223 3.8108 3.8660 3.9804 1.0131 1.0158 1.0067 1.0079 1.0094 1.0087 1.0089 1.0079 1.0069 1.0083 1.0087 1.0074 0.9892 0.9922 1.0049 1.0113 1.0041 1.0027 0.9975 0.9928 0.9955 1.0116 1.0046 1.0008 1.0021 1.0091 0.9856 0.9889 0.9937
dispcorr: -0.031340692 hartree
energy: -1510.100997251348
dipole: -17.79366 17.07229 -0.72138 31.09055 -29.34859 1.74196 -5.73291 4.65414 -1.07878
magnitude: 2.17223 au
magnitude: 5.52136 debye
