program: Orca
programVersion: 5.0.2
elementType: Si F O O C C C C C C C C C C C C C C C C C C C C C C C C C H H H H H H H H H H H H H H H H H H H H H H H H H H H H H
charge: 0
multiplicity: 1
keywords: wb97x-d3
keywords: def2-TZVPP
keywords: def2/J RIJCOSX
keywords: DEFGRID2
keywords: scfconv7
keywords: smallprint printgap noloewdin
keywords: NOSOSCF
formula: C25H29FO2Si
InChI: InChI=1/C25H29FO2Si/c1-4-27-21-13-15-23(16-14-21)29(2,3)18-8-9-20-12-17-24(26)25(19-20)28-22-10-6-5-7-11-22/h5-7,10-17,19H,4,8-9,18H2,1-3H3
58 atoms
Si -3.495794 1.33314 0.045138
F  1.693598 -2.931622 1.857985
O  2.163613 2.542077 1.825637
O  2.169435 -1.92891 -0.540021
C  -3.687686 -0.496784 -0.370908
C  -3.020019 -0.907904 -1.686302
C  -1.703361 1.641046 0.542767
C  -4.611286 1.76589 1.501572
C  -3.930369 2.410121 -1.436595
C  -2.589728 -2.3813 -1.726193
C  -1.019336 0.762961 1.385257
C  -1.015299 2.79624 0.154437
C  -1.444472 -2.629849 -0.785729
C  0.272337 1.010321 1.836494
C  0.269387 3.065679 0.590049
C  0.926468 2.17638 1.442481
C  -0.167596 -2.199607 -1.143859
C  -1.632749 -3.195236 0.470498
C  0.890513 -2.287487 -0.254375
C  -0.575952 -3.308918 1.365388
C  0.666435 -2.844143 1.000018
C  2.942653 1.700404 2.666627
C  3.595034 0.553796 1.924455
C  2.472158 -0.845763 -1.318807
C  1.668853 0.283602 -1.416164
C  3.697674 -0.899442 -1.971164
C  2.100998 1.354881 -2.186526
C  4.118905 0.183063 -2.728119
C  3.321548 1.313749 -2.845317
H  -3.263286 -1.05742 0.469615
H  -4.747433 -0.770245 -0.387976
H  -2.134084 -0.295072 -1.887629
H  -3.70541 -0.713005 -2.514747
H  -4.501172 2.812709 1.793246
H  -5.665169 1.60133 1.265202
H  -4.375566 1.159392 2.379097
H  -3.870631 3.474814 -1.201072
H  -3.275048 2.227194 -2.290442
H  -4.953684 2.214891 -1.765965
H  -3.437028 -3.021953 -1.469548
H  -2.292234 -2.64064 -2.745465
H  -1.494312 -0.154699 1.716304
H  -1.488445 3.51636 -0.503887
H  0.744002 0.284797 2.485961
H  0.776118 3.969963 0.274122
H  -0.005607 -1.780324 -2.130051
H  -2.613329 -3.548247 0.763632
H  -0.719612 -3.746054 2.345405
H  2.349313 1.339246 3.512174
H  3.710119 2.356831 3.077856
H  4.178937 0.914795 1.076922
H  4.277505 0.035843 2.600156
H  2.877254 -0.180352 1.56222
H  0.720555 0.346415 -0.898982
H  4.318506 -1.781779 -1.877328
H  1.471705 2.232358 -2.261707
H  5.076227 0.137239 -3.231222
H  3.649798 2.155121 -3.441273
elementType: Si F O C H
totalener: -1510.06779486 hartree
nucrepener: 3053.97091341 hartree
electener: -4564.03870828 hartree
oneelecener: -8138.35087310 hartree
twoeener: 3574.31216483 hartree
cpcmener: -0.02158813 hartree
kineticenergy: 1503.89936528 hartree
xcener: -135.234268086858 hartree
chargesum: 0.0000000
charge: 0.462094 -0.221585 -0.329839 -0.323384 -0.273111 -0.134273 -0.150611 -0.416847 -0.442174 -0.088346 -0.189144 -0.045913 0.064228 -0.215786 -0.354004 0.359077 -0.238923 -0.262337 0.248510 -0.113777 0.138606 0.042390 -0.234499 0.270548 -0.123310 -0.235447 -0.180929 -0.136504 -0.168290 0.077630 0.096323 0.070639 0.093210 0.100772 0.100736 0.099677 0.105269 0.108375 0.111091 0.082783 0.095276 0.139059 0.138611 0.136968 0.130115 0.151008 0.145050 0.146881 0.086598 0.107450 0.083611 0.101027 0.051726 0.120050 0.142840 0.156420 0.156270 0.158115
qa: 0.4621 -0.2216 -0.3298 -0.3234 -0.2731 -0.1343 -0.1506 -0.4168 -0.4422 -0.0883 -0.1891 -0.0459 0.0642 -0.2158 -0.3540 0.3591 -0.2389 -0.2623 0.2485 -0.1138 0.1386 0.0424 -0.2345 0.2705 -0.1233 -0.2354 -0.1809 -0.1365 -0.1683 0.0776 0.0963 0.0706 0.0932 0.1008 0.1007 0.0997 0.1053 0.1084 0.1111 0.0828 0.0953 0.1391 0.1386 0.1370 0.1301 0.1510 0.1450 0.1469 0.0866 0.1074 0.0836 0.1010 0.0517 0.1200 0.1428 0.1564 0.1563 0.1581
va: 4.1400 1.0598 2.0676 2.0654 3.8415 3.8874 3.7140 3.8933 3.9092 3.8715 3.8505 3.7655 3.5940 3.7878 4.0156 3.6790 3.9089 3.9030 3.6481 3.8572 4.0098 3.8716 3.9104 3.6647 3.8019 3.9730 3.9326 3.9059 3.9146 1.0179 1.0139 1.0024 1.0074 1.0101 1.0098 1.0097 1.0093 1.0056 1.0083 1.0080 1.0068 0.9844 0.9866 1.0083 1.0179 1.0019 1.0019 0.9981 0.9960 0.9908 1.0061 1.0133 1.0086 1.0003 1.0104 0.9953 0.9894 0.9903
dispcorr: -0.037245662 hartree
energy: -1510.105040527094
dipole: -18.77527 17.96048 -0.81480 13.63251 -13.77249 -0.13998 -4.39457 4.05358 -0.34099
magnitude: 0.89430 au
magnitude: 2.27312 debye
