program: Orca
programVersion: 5.0.2
elementType: Si F O O C C C C C C C C C C C C C C C C C C C C C C C C C H H H H H H H H H H H H H H H H H H H H H H H H H H H H H
charge: 0
multiplicity: 1
keywords: wb97x-d3
keywords: def2-TZVPP
keywords: def2/J RIJCOSX
keywords: DEFGRID2
keywords: scfconv7
keywords: smallprint printgap noloewdin
keywords: NOSOSCF
formula: C25H29FO2Si
InChI: InChI=1/C25H29FO2Si/c1-4-27-21-13-15-23(16-14-21)29(2,3)18-8-9-20-12-17-24(26)25(19-20)28-22-10-6-5-7-11-22/h5-7,10-17,19H,4,8-9,18H2,1-3H3
58 atoms
Si -4.093859 0.873494 0.744214
F  1.991004 -1.808319 1.304977
O  1.735756 2.467271 1.112798
O  1.64089 -0.153219 -0.845404
C  -4.155442 -0.85249 -0.016129
C  -3.610702 -0.907565 -1.45118
C  -2.282481 1.372152 0.873264
C  -4.854457 0.824176 2.46567
C  -5.007517 2.105168 -0.345471
C  -2.731789 -2.132193 -1.731309
C  -1.46141 0.836163 1.864859
C  -1.68128 2.264004 -0.022481
C  -1.456035 -2.097563 -0.935973
C  -0.11684 1.167905 1.981763
C  -0.344442 2.60855 0.070878
C  0.450583 2.067789 1.08225
C  -0.450268 -1.194012 -1.28022
C  -1.263123 -2.906335 0.17856
C  0.707623 -1.097482 -0.531574
C  -0.103436 -2.819774 0.941057
C  0.867257 -1.913999 0.581085
C  2.595901 1.94301 2.116704
C  3.95224 2.583905 1.959888
C  2.865419 -0.527358 -1.31848
C  3.819309 0.481623 -1.392483
C  3.169702 -1.816766 -1.736261
C  5.086438 0.19173 -1.872748
C  4.446706 -2.090565 -2.21188
C  5.411313 -1.096479 -2.280467
H  -3.56915 -1.499543 0.646169
H  -5.172877 -1.253191 0.019965
H  -3.02235 -0.015229 -1.693056
H  -4.443425 -0.901886 -2.158093
H  -4.803148 1.795341 2.962247
H  -5.907172 0.534909 2.421546
H  -4.35147 0.100581 3.111041
H  -4.623367 2.123394 -1.36759
H  -6.06782 1.848696 -0.407932
H  -4.94476 3.122863 0.045743
H  -3.288001 -3.0451 -1.504275
H  -2.495313 -2.164573 -2.798284
H  -1.866459 0.134255 2.586237
H  -2.265479 2.712319 -0.818325
H  0.464885 0.718603 2.775235
H  0.092493 3.302727 -0.63727
H  -0.566246 -0.544506 -2.140758
H  -2.026553 -3.61875 0.465659
H  0.038835 -3.447021 1.811963
H  2.671516 0.855206 2.019324
H  2.191145 2.158661 3.111314
H  3.89963 3.667138 2.074469
H  4.622743 2.200335 2.729151
H  4.397457 2.357831 0.990394
H  3.56516 1.486192 -1.076684
H  2.431421 -2.608338 -1.706106
H  5.824087 0.982524 -1.924435
H  4.68151 -3.098161 -2.531513
H  6.4036 -1.321168 -2.649448
elementType: Si F O C H
totalener: -1510.07022473 hartree
nucrepener: 3031.57408803 hartree
electener: -4541.64431276 hartree
oneelecener: -8094.54294952 hartree
twoeener: 3552.89863675 hartree
cpcmener: -0.02346305 hartree
kineticenergy: 1503.90128747 hartree
xcener: -135.230333210073 hartree
chargesum: 0.0000000
charge: 0.478317 -0.223858 -0.328750 -0.309978 -0.271617 -0.119111 -0.119700 -0.446347 -0.427312 -0.103114 -0.215405 -0.113116 0.072376 -0.199277 -0.265033 0.326554 -0.246226 -0.188765 0.143438 -0.150281 0.246569 0.029016 -0.270514 0.321957 -0.284700 -0.201400 -0.118747 -0.159846 -0.191562 0.077017 0.095805 0.063530 0.094184 0.103482 0.102428 0.099808 0.100368 0.106949 0.109176 0.087366 0.095951 0.131792 0.140869 0.134175 0.130898 0.130736 0.144783 0.145772 0.094616 0.110780 0.091100 0.092411 0.084012 0.150353 0.148914 0.155768 0.157166 0.156222
qa: 0.4783 -0.2239 -0.3288 -0.3100 -0.2716 -0.1191 -0.1197 -0.4463 -0.4273 -0.1031 -0.2154 -0.1131 0.0724 -0.1993 -0.2650 0.3266 -0.2462 -0.1888 0.1434 -0.1503 0.2466 0.0290 -0.2705 0.3220 -0.2847 -0.2014 -0.1187 -0.1598 -0.1916 0.0770 0.0958 0.0635 0.0942 0.1035 0.1024 0.0998 0.1004 0.1069 0.1092 0.0874 0.0960 0.1318 0.1409 0.1342 0.1309 0.1307 0.1448 0.1458 0.0946 0.1108 0.0911 0.0924 0.0840 0.1504 0.1489 0.1558 0.1572 0.1562
va: 4.1447 1.0533 2.0509 2.0234 3.8309 3.8703 3.6673 3.9065 3.9070 3.8621 3.9286 3.8355 3.5708 3.8045 4.0195 3.6970 3.9832 3.8892 3.5955 3.9317 3.9177 3.7891 3.9684 3.6941 3.9604 3.9061 3.9057 3.9203 3.9135 1.0175 1.0108 1.0071 1.0085 1.0094 1.0107 1.0111 1.0089 1.0092 1.0071 1.0064 1.0064 0.9960 0.9867 1.0113 1.0136 1.0194 1.0005 1.0003 0.9921 0.9914 1.0041 1.0062 1.0037 1.0152 1.0052 0.9916 0.9909 0.9908
dispcorr: -0.035689747 hartree
energy: -1510.105914480759
dipole: -18.88319 18.37439 -0.50880 7.98299 -8.93150 -0.94851 1.67025 -1.60325 0.06700
magnitude: 1.07845 au
magnitude: 2.74119 debye
