program: Orca
programVersion: 5.0.2
elementType: Si F O O C C C C C C C C C C C C C C C C C C C C C C C C C H H H H H H H H H H H H H H H H H H H H H H H H H H H H H
charge: 0
multiplicity: 1
keywords: wb97x-d3
keywords: def2-TZVPP
keywords: def2/J RIJCOSX
keywords: DEFGRID2
keywords: scfconv7
keywords: smallprint printgap noloewdin
keywords: NOSOSCF
formula: C25H29FO2Si
InChI: InChI=1/C25H29FO2Si/c1-4-27-21-13-15-23(16-14-21)29(2,3)18-8-9-20-12-17-24(26)25(19-20)28-22-10-6-5-7-11-22/h5-7,10-17,19H,4,8-9,18H2,1-3H3
58 atoms
Si -3.861838 -0.077022 1.432523
F  2.60022 0.213398 -0.517435
O  0.841602 3.724858 1.667577
O  1.602835 -2.338455 -0.484735
C  -3.558523 -1.108192 -0.119432
C  -3.589824 -0.28305 -1.412496
C  -2.407521 1.112823 1.567788
C  -3.899647 -1.199199 2.942937
C  -5.465134 0.896656 1.291381
C  -2.581872 -0.751716 -2.470087
C  -2.522113 2.481445 1.301732
C  -1.132342 0.642312 1.883399
C  -1.167268 -0.512674 -2.020328
C  -1.430232 3.330268 1.343728
C  -0.020969 1.474363 1.937864
C  -0.165625 2.832242 1.659949
C  -0.377114 -1.55278 -1.539801
C  -0.642266 0.778344 -2.008338
C  0.890517 -1.311504 -1.033158
C  0.629579 1.032373 -1.518308
C  1.378655 -0.013872 -1.024009
C  2.16264 3.277281 1.943077
C  3.086898 4.464326 1.836314
C  2.829609 -2.660102 -0.998801
C  3.695608 -3.334001 -0.147194
C  3.202042 -2.373779 -2.305365
C  4.946119 -3.715171 -0.607397
C  4.460618 -2.757822 -2.748889
C  5.338846 -3.424905 -1.907543
H  -2.575826 -1.573254 0.018962
H  -4.264317 -1.941614 -0.185111
H  -3.391297 0.776406 -1.215412
H  -4.5952 -0.31516 -1.838699
H  -2.973272 -1.768568 3.047474
H  -4.037718 -0.630844 3.865077
H  -4.715852 -1.92269 2.880373
H  -5.637544 1.526261 2.166926
H  -5.482988 1.544837 0.412865
H  -6.3195 0.220921 1.208108
H  -2.734716 -1.812659 -2.682616
H  -2.766246 -0.212638 -3.403011
H  -3.486997 2.90862 1.05246
H  -0.977427 -0.411082 2.093403
H  -1.547955 4.385961 1.129262
H  0.940656 1.047464 2.189538
H  -0.75162 -2.569817 -1.542029
H  -1.234838 1.6055 -2.380043
H  1.031109 2.037632 -1.505848
H  2.4571 2.500325 1.229802
H  2.213921 2.841652 2.946675
H  4.108198 4.147469 2.048698
H  3.073596 4.893612 0.833884
H  2.824142 5.244097 2.551931
H  3.390495 -3.553574 0.868473
H  2.527791 -1.863352 -2.981915
H  5.619945 -4.235425 0.061204
H  4.750953 -2.530567 -3.766627
H  6.318885 -3.716901 -2.260823
elementType: Si F O C H
totalener: -1510.07029365 hartree
nucrepener: 2934.27454477 hartree
electener: -4444.34483842 hartree
oneelecener: -7899.34050193 hartree
twoeener: 3454.99566351 hartree
cpcmener: -0.02286169 hartree
kineticenergy: 1503.91035356 hartree
xcener: -135.230092268308 hartree
chargesum: 0.0000000
charge: 0.481637 -0.225285 -0.326826 -0.329732 -0.269535 -0.129561 -0.140347 -0.438106 -0.432960 -0.091413 -0.087524 -0.190327 0.082792 -0.287049 -0.256867 0.354450 -0.272712 -0.239313 0.222594 -0.164035 0.238744 0.064796 -0.272333 0.283084 -0.250724 -0.177257 -0.122265 -0.159412 -0.186088 0.080565 0.095334 0.066152 0.092223 0.099461 0.102874 0.102270 0.109188 0.100930 0.107928 0.085218 0.096425 0.142268 0.134204 0.131183 0.135108 0.134238 0.142365 0.152555 0.082065 0.097333 0.089105 0.086318 0.087698 0.143911 0.153124 0.156565 0.158026 0.156940
qa: 0.4816 -0.2253 -0.3268 -0.3297 -0.2695 -0.1296 -0.1403 -0.4381 -0.4330 -0.0914 -0.0875 -0.1903 0.0828 -0.2870 -0.2569 0.3544 -0.2727 -0.2393 0.2226 -0.1640 0.2387 0.0648 -0.2723 0.2831 -0.2507 -0.1773 -0.1223 -0.1594 -0.1861 0.0806 0.0953 0.0662 0.0922 0.0995 0.1029 0.1023 0.1092 0.1009 0.1079 0.0852 0.0964 0.1423 0.1342 0.1312 0.1351 0.1342 0.1424 0.1526 0.0821 0.0973 0.0891 0.0863 0.0877 0.1439 0.1531 0.1566 0.1580 0.1569
va: 4.1417 1.0538 2.0733 2.0651 3.8276 3.8982 3.7066 3.9016 3.9132 3.8445 3.8240 3.9007 3.5570 4.0441 3.8428 3.7100 3.9887 3.8981 3.7233 3.8488 3.8991 3.7921 3.9760 3.6852 3.9990 3.8759 3.8961 3.9102 3.9007 1.0142 1.0119 1.0055 1.0089 1.0110 1.0091 1.0107 1.0077 1.0076 1.0093 1.0082 1.0057 0.9870 0.9937 1.0151 1.0128 1.0170 1.0030 0.9928 0.9920 0.9890 1.0058 1.0038 1.0039 1.0099 1.0014 0.9894 0.9909 0.9906
dispcorr: -0.032315047 hartree
energy: -1510.102608696253
dipole: -19.62391 19.47393 -0.14998 6.13017 -6.26614 -0.13596 6.42761 -7.01286 -0.58525
magnitude: 0.61928 au
magnitude: 1.57407 debye
